{"text_format":"1","workbook":"xlsx","n_sheets":5,"sheets":["Getting Started","Classic Maple","Metal Snares","Legacy","Gallery"],"not_rendered":{"charts":0,"images":41,"macros":1,"external_links":0,"defined_names":7,"comments":0,"pivot_tables":0},"unopened":[],"bounds":{"document_bytes":16777216,"sheet_cells":100000,"rows_first":2000,"rows_last":500,"rows_between":2000,"halvings":0,"cell_chars":16384,"cell_head_chars":4096},"cells_cut":0,"cells_raw":0,"read":"whole","date_system":"1900"}

{"sheet":"Getting Started","index":0,"n_rows":33,"n_cols":1,"rows_kept":33,"cut":false,"hidden":true,"merged":[]}
["Thank you for using the Ludwig Configuration Guide!"]
[]
["To get started, select Classic Maple, Legacy or Metal Snares from the tabs at the bottom."]
[]
["Your computer may block macros.  If it does, you should have the option to \"Enable Content\" to allow the macros in this worksheet to function.  "]
[]
["On the Classic Maple and Legacy pages, start by selecting the sizes that you want.  Retail prices will appear to the right of each drum that you select."]
[]
["Based on the sizes you choose, other boxes will be highlighted in yellow.  "]
[]
["For example, if you select a bass drum, the choices for Tom Holder and Spurs will be highlighted, inviting you to make a choice from those groups."]
[]
["Anything highlighted in yellow is waiting for you to make a selection. "]
[]
["To help you make your selections, there are pictures of many of the available hardware pieces on the tab called \"Gallery\"."]
[]
["Some options are available at no charge.  When you select something that does cost extra, like a premium finish or a tom holder, that cost is automatically rolled into the cost for each drum that it applies to. "]
[]
["If you select options that conflict with each other or with the size of the drum, an error message will appear in red to let you know that something needs to change."]
[]
["For example, if you choose Mini Classic lugs on a 5x14 snare, \"Lug Error\" will appear because those lugs won't fit on a 5x14.  You need to choose smaller lugs or a larger snare."]
[]
["Bold font indicates \"Standard\".  "]
[]
["If you want to have different options on drums of the same type, (e.g., mini classic lugs on one tom and large classic lugs on another), fill out a separate order guide for one of the drums."]
[]
["On the \"Metal Snares\" page, start with a basic drum and option it out to your liking.  The \"Codification\" column on that page will return a custom number or a standard item for what you've selected if there is one."]
[]
["When you're done, you can print out your set.  What prints is a summary of the sizes and features."]
[]
["If you are a Ludwig Dealer, the best way to order from us is to save the file and email it to us.  Using the po number or customer's name for the file name works great and helps both of us keep track of the original order.  You can also print and fax it to us if you prefer."]
[]
["If you are  ordering a drumset for yourself, you can place your order with any Ludwig dealer by sending them this order guide.  "]

{"sheet":"Classic Maple","index":1,"n_rows":221,"n_cols":140,"rows_kept":221,"cut":false,"hidden":false,"merged":[[27,133,27,137],[2,0,23,0],[24,0,33,0],[0,10,0,13],[0,15,0,16],[2,133,2,137],[17,133,17,137],[20,134,20,137],[5,134,5,137],[60,0,68,0],[34,0,59,0],[37,133,37,137],[30,134,30,137],[40,134,40,137],[51,9,53,9],[55,9,56,9]]}
[null," Classic Maple Order Guide 16",null,null,null,"For best results, enable macros.",null,null,null,"Dealer",null,null,null,null,"PO",null,null,null,null,null,null,null,null,null,null,null,null,null,null,null,null,null,null,null,null,null,null,null,null,null,null,null,null,null,null,null,null,null,null,null,null,null,null,null,null,null,null,null,null,null,null,null,null,null,null,"Option Pricing",null,"Finish",null,"Holder,","Spurs","Shell","Claws & ",null,null,null,"Total",null,"Safeguards",null,null,"Safeguards",null,null,"Safeguards",null,null,"Safeguards",null,null,"Safeguards",null,null,"Safeguards",null,null,"Safeguards",null,null,null,"Codification",null,null,null,null,null,null,null,null,null,null,null,null,null,null,null,null,null,null,null,null,null,null,null,null,null,null,null,null,null,null,null,null,"Output (print area)"]
[null,null,"Drum Size ","Retail",null,"Finish",null,{"$f":"IF(AR65+AR66+AR68>0,\"BD Hoop Accent\",\"Bass Hoop Inlay\")","v":"Bass Hoop Inlay"},null,null,null,"Mini","Large","Long","Small","Large",null,null,null,null,null,null,null,null,null,null,null,null,null,null,null,null,"IF",null,null,null,null,"Selected","Is num","Qty","Drum Size",2015,null,"Selected","Finish","BTF upcharge","SD Upcharge",null,null,"Hoop Inlay",null,null,"Mini","Large","Long","Small","Large",null,null,null,null,null,null,null,null,"BTF Finish","SD Finish","Upcharge","lugs","legs, brkt","Tone Cntr","Mount","Screws","Brass","Badge","Hoops","Options",null,null,null,null,null,null,null,null,null,null,null,null,null,null,null,null,null,null,null,null,null,null,null,null,null,"Size","Holder","Finish","Lugs","Cstm","Conc","iserr","final",null,null,null,null,null,null,"Option","Upcharge",null,null,null,null,null,null,null,null,null,null,null,null,null,null,null,{"$f":"IF(AN71=1,\"Bass Drum\",CONCATENATE(AN71,\" Bass Drums Chosen\"))","v":"0 Bass Drums Chosen"},"Check Main Page for Errors",null,"Order Total",{"$f":"D71","v":0},null,"."]
["M P L B D C U S T O M",null,"12x18 Bass Drum",{"$f":"+AN3*(AP3+BY3)","v":0},null,null,"0G Black Cortex",null,null,null,"Lugs","Classic","Classic","(Mach)","Twin","Twin","Tube",null,null,null,null,null,null,null,null,null,null,null,null,null,null,null,{"$f":"IF(AN3>0,CONCATENATE(\"qty \",AN3,\") \",AO3,\"   \"),\"\")","v":""},null,null,null,"bd",{"$f":"IF(B3=\"\",0,1)","v":0},{"$f":"ISNUMBER(B3)","v":false},{"$f":"IF(AM3=TRUE,B3,AL3)","v":0},"12x18",1366,null,{"$f":"IF(F3=\"\",0,1)","v":0},"0G Black Cortex",0,0,null,{"$f":"IF(H3=\"\",0,1)","v":0},"0G Black Cortex",null,null,"Classic","Classic","(Mach)","Twin","Twin","Tube","Selected","upcharge",null,null,null,null,null,{"$f":"AR3*AT3","v":0},{"$f":"AR3*AU3","v":0},{"$f":"+$BN$72","v":0},{"$f":"+$BH$5","v":0},{"$f":"+$BB$33","v":0},{"$f":"+$BI$17","v":0},{"$f":"+$AW$68","v":0},{"$f":"+$BA$12 + $BE$13","v":0},{"$f":"IF($AZ$16=1,$DN$11,0)","v":0},{"$f":"$AZ$51","v":0},{"$f":"$AT$75","v":0},{"$f":"SUM(BP3:BX3)","v":0},null,"Tom Holder vs Tom Bracket",null,null,"Brass vs. Everything",null,null,"Matching Bass Hoops",null,null,"Size vs. Lugs",null,null,"Size vs. Vibrabands",null,null,"Size vs. Hoops",null,null,"Size (Dia) vs. Curved Spurs",null,null,"12x18",{"$f":"AL3","v":0},"LB828",{"$f":"VLOOKUP(1,CW3:CX3,2,FALSE)","v":{"$error":"#N/A"}},{"$f":"VLOOKUP(1,$AZ$20:$BE$32,6,FALSE)","v":{"$error":"#N/A"}},{"$f":"LEFT(VLOOKUP(1,$AR$3:$AS$56,2,FALSE),2)","v":{"$error":"#N/A"}},{"$f":"IF($BA$5=1,\"\",VLOOKUP(1,$CX$74:$CY$75,2,FALSE))","v":{"$error":"#N/A"}},{"$f":"IF($AZ$16=1,\"B Cstm  \",\" Cstm  \"  )","v":" Cstm  "},{"$f":"CONCATENATE(CY3,CZ3,DA3,DB3,DC3)","v":{"$error":"#N/A"}},{"$f":"ISERROR(DD3)","v":true},{"$f":"IF(DE3=FALSE,DD3,\"\")","v":""},null,null,null,null,"New Loc",null,"Description",null,"Where used",null,null,null,null,null,null,null,null,null,null,null,null,null,null,{"$f":"DH24","v":""},null,null,null,null,null,"."]
[null,null,"14x18 Bass Drum",0,null,null,"BG Black Galaxy",null,null,"Lug Error","Snare",null,null,null,null,null,null,null,null,null,null,null,null,null,null,null,null,null,null,null,null,null,{"$f":"IF(AN4>0,CONCATENATE(\"qty \",AN4,\") \",AO4,\"   \"),\"\")","v":""},null,null,null,"bd",0,false,0,"14x18",1366,null,{"$f":"IF(F4=\"\",0,1)","v":0},"BG Black Galaxy",0,0,null,0,"BG Black Galaxy",null,"Snare",{"$f":"IF(L4=\"\",0,1)","v":0},null,null,{"$f":"IF(O4=\"\",0,1)","v":0},{"$f":"IF(P4=\"\",0,1)","v":0},{"$f":"IF(Q4=\"\",0,1)","v":0},{"$f":"SUM(BA4:BF4)","v":0},{"$f":"(BF4*DN6)+(BA4*DN7)","v":0},null,null,null,null,null,0,{"$f":"AR4*AU4","v":0},0,{"$f":"+$BH$5","v":0},0,0,0,{"$f":"+$BA$12 + $BE$13","v":0},0,0,0,{"$f":"SUM(BP4:BX4)","v":0},null,null,null,null,"Anti-Brass Sizes",null,null,"Finishes that get MH BD Hoops",null,null,null,null,null,null,null,null,null,null,null,{"$f":"+AL3","v":0},"12x18",null,"14x18",0,"LB848",{"$error":"#N/A"},{"$error":"#N/A"},{"$error":"#N/A"},{"$error":"#N/A"}," Cstm  ",{"$error":"#N/A"},{"$f":"ISERROR(DD4)","v":true},{"$f":"IF(DE4=FALSE,DD4,\"\")","v":""},null,null,null,null,"DM4",null,"Large Classic Lugs (Bass, Tom, Floor)",30,null,null,null,null,null,null,null,null,null,null,null,null,null,null,null,"Shell Type","Classic Maple, MPLBDCUSTOM",null,null,null,null,"."]
[null,null,"16x18 Bass Drum",0,null,null,"0Q Black Oyster Pearl",null,null,"Lug Error","Bass",null,null,null,null,null,null,null,null,null,null,null,null,null,null,null,null,null,null,null,null,null,{"$f":"IF(AN5>0,CONCATENATE(\"qty \",AN5,\") \",AO5,\"   \"),\"\")","v":""},null,null,null,"bd",0,false,0,"16x18",1366,null,0,"0Q Black Oyster Pearl",0,0,null,0,"0Q Black Oyster Pearl",null,"Bass",{"$f":"IF(L5=\"\",0,1)","v":0},{"$f":"IF(M5=\"\",0,1)","v":0},0,null,null,null,{"$f":"SUM(BA5:BF5)","v":0},{"$f":"(BB5*DN4)+(BC5*DN5)","v":0},null,null,null,null,null,0,{"$f":"AR5*AU5","v":0},0,0,0,0,0,{"$f":"+$BA$12 + $BE$13","v":0},0,0,0,0,null,"10.5 mm Tom holder",null,null,{"$f":"+AL3","v":0},"12x18",null,{"$f":"+AR3+AR25","v":0},"Black or White Cortex",null,"Size vs Mini Classic",null,null,null,"tom bracket",null,{"$f":"+BE42","v":0},"PDC (snares only)",null,0,"14x18",null,"16x18",0,"LB868",{"$error":"#N/A"},{"$error":"#N/A"},{"$error":"#N/A"},{"$error":"#N/A"}," Cstm  ",{"$error":"#N/A"},{"$f":"ISERROR(DD5)","v":true},{"$f":"IF(DE5=FALSE,DD5,\"\")","v":""},null,null,null,null,"DM5",null,"Long Lugs (Bass, Tom, Floor)",40,null,null,null,null,null,null,null,null,null,null,null,null,null,null,null,"Drum Type","Bass Drum",null,"Total Bass Drums",{"$f":"SUM(D3:D24)","v":0},null,"."]
[null,null,"12x20 Bass Drum",0,null,null,"0R Black Sparkle",null,null,null,"Floor",null,null,null,null,null,null,null,null,null,null,null,null,null,null,null,null,null,null,null,null,null,{"$f":"IF(AN6>0,CONCATENATE(\"qty \",AN6,\") \",AO6,\"   \"),\"\")","v":""},null,null,null,"bd",0,false,0,"12x20",1458,null,0,"0R Black Sparkle",0,0,null,0,"0R Black Sparkle",null,"Floor",{"$f":"IF(L6=\"\",0,1)","v":0},0,0,null,null,null,{"$f":"SUM(BA6:BF6)","v":0},{"$f":"(BB6*DN4)+(BC6*DN5)","v":0},null,null,null,null,null,0,0,0,0,0,0,0,{"$f":"+$BA$12 + $BE$13","v":0},0,0,0,0,null,{"$f":"+AZ22","v":0},"LR2991MT Elite Single Tom Holder",null,0,"14x18",null,{"$f":"SUM(AR30:AR43)","v":0},"Lacquers",null,{"$f":"+BA4","v":0},"Mini lugs (SD)",null,{"$f":"+BH25","v":0},"L_RL Vibraband w/ Ludwig Brkt",null,null,null,null,0,"16x18",null,"12x20",0,"LB820",{"$error":"#N/A"},{"$error":"#N/A"},{"$error":"#N/A"},{"$error":"#N/A"}," Cstm  ",{"$error":"#N/A"},true,"",null,null,null,null,"DM6",null,"Tube Lugs (Snare)",45,null,null,null,null,null,null,null,null,null,null,null,null,null,null,null,"Size",{"$f":"AG76","v":""},null,null,null,null,"."]
[null,null,"14x20 Bass Drum",0,null,null,"32 Blue Sparkle",null,null,"Lug Error","Tom",null,null,null,null,null,null,null,null,null,null,null,null,null,null,null,null,null,null,null,null,null,{"$f":"IF(AN7>0,CONCATENATE(\"qty \",AN7,\") \",AO7,\"   \"),\"\")","v":""},null,null,null,"bd",{"$f":"IF(B7=\"\",0,1)","v":0},{"$f":"ISNUMBER(B7)","v":false},{"$f":"IF(AM7=TRUE,B7,AL7)","v":0},"14x20",1458,null,0,"32 Blue Sparkle",0,0,null,0,"32 Blue Sparkle",null,"Tom",{"$f":"IF(L7=\"\",0,1)","v":0},0,0,null,null,null,{"$f":"SUM(BA7:BF7)","v":0},{"$f":"(BB7*DN4)+(BC7*DN5)","v":0},null,null,null,null,null,0,0,0,0,0,0,0,{"$f":"+$BA$12 + $BE$13","v":0},0,0,0,0,null,{"$f":"+AZ23","v":0},"LR2992MT Classic Double",null,0,"16x18",null,{"$f":"SUM(AR44:AR50)","v":0},"Exotics",null,null,null,null,{"$f":"+BH27","v":0},"L_RK Vibraband w/ Keystone Bracket",null,{"$f":"+AL61","v":0},"6x12",null,{"$f":"AL6+AL7","v":0},"12x20  & 14x20",null,"14x20",{"$f":"AL7","v":0},"LB840",{"$error":"#N/A"},{"$error":"#N/A"},{"$error":"#N/A"},{"$error":"#N/A"}," Cstm  ",{"$error":"#N/A"},true,"",null,null,null,null,"DM7",null,"Mini Classic Lugs (Snare)",0,null,null,null,null,null,null,null,null,null,null,null,null,null,null,null,"Finish",{"$f":"VLOOKUP(1,AR3:AS56,2,FALSE)","v":{"$error":"#N/A"}},null,"Left Front Placement",{"$f":"IF(AV64=1,\"There\",\"Not There\")","v":"Not There"},null,"."]
[null,null,"16x20 Bass Drum",0,null,null,"0C Champagne Sparkle",null,null,null,null,null,null,null,null,null,null,null,null,null,null,null,null,null,null,null,null,null,null,null,null,null,"",null,null,null,"bd",0,false,0,"16x20",1458,null,0,"0C Champagne Sparkle",200,200,null,0,"0C Champagne Sparkle",null,null,"ML Mini Classic","CL Large Classic","LL Long Lugs","ST Small Twin","LT Large Twin","TB Tube",null,null,null,null,null,null,null,0,0,0,0,0,0,0,0,0,0,0,0,null,{"$f":"+AZ32","v":0},"LR2993MT Rail Consolette 10.5mm",null,{"$f":"+AL6+ AL7","v":0},"12x20 & 14x20",null,null,null,null,{"$f":"+AL62","v":0},"3Hx13",null,{"$f":"SUM(CM6:CM7)","v":0},"sum of conflict brkts",null,{"$f":"+AL62","v":0},"3Hx13",null,{"$f":"+AL8","v":0},"16x20",null,"16x20",0,"LB860",{"$error":"#N/A"},{"$error":"#N/A"},{"$error":"#N/A"},{"$error":"#N/A"}," Cstm  ",{"$error":"#N/A"},true,"",null,null,null,null,null,null,null,null,null,null,null,null,null,null,null,null,null,null,null,null,null,null,null,"Bass Hoops",{"$f":"VLOOKUP(1,AR59:AS73,2,FALSE)","v":{"$error":"#N/A"}},null,"Right Front Placement",{"$f":"IF(AV65=1,\"There\",\"Not There\")","v":"Not There"},null,"."]
[null,null,"18x20 Bass Drum",0,null,null,"35 Customer Supply",null,null,null,"Bass Screws",null,"Rod/Claw Conflict",null,"Bass Claws",null,null,null,null,null,null,null,null,null,null,null,null,null,null,null,null,null,"",null,null,null,"bd",0,false,0,"18x20",1458,null,0,"35 Customer Supply",0,0,null,0,"35 Customer Supply",null,"Bass Screws",null,null,null,"Bass Claws",null,null,null,null,null,null,null,null,null,0,0,0,0,0,0,0,0,0,0,0,0,null,{"$f":"SUM(CA6:CA8)","v":0},"returns a 1 if 10.5mm tom holder",null,{"$f":"+AL8","v":0},"16x20",null,null,null,null,{"$f":"+AL64","v":0},"3Hx14",null,null,null,null,{"$f":"+AL63","v":0},"6x13",null,{"$f":"+AL9","v":0},"18x20",null,"18x20",0,"LB880",{"$error":"#N/A"},{"$error":"#N/A"},{"$error":"#N/A"},{"$error":"#N/A"}," Cstm  ",{"$error":"#N/A"},true,"",null,null,null,null,"DM9",null,"Bass Drum T handles",40,null,null,null,null,null,null,null,null,null,null,null,null,null,null,null,"Accent Color",{"$f":"IFERROR(VLOOKUP(1,AW3:AX40,2,FALSE),\"\")","v":""},null,"Left Back Placement",{"$f":"IF(AV66=1,\"There\",\"Not There\")","v":"Not There"},null,"."]
[null,null,"12x22 Bass Drum",0,null,null,"33 Gold Sparkle",null,null,null,null,"K Keyrods",null,null,null,"P2306 Die Cast",null,null,null,null,null,null,null,null,null,null,null,null,null,null,null,null,{"$f":"IF(AN10>0,CONCATENATE(\"qty \",AN10,\") \",AO10,\"   \"),\"\")","v":""},null,null,null,"bd",0,false,0,"12x22",1512,null,0,"33 Gold Sparkle",0,0,null,0,"33 Gold Sparkle",null,{"$f":"IF(K10=\"\",0,1)","v":0},{"$f":"+AZ10*0","v":0},"K Keyrods",null,{"$f":"IF(O10=\"\",0,1)","v":0},{"$f":"+BD10*DN10","v":0},"P2306 Die Cast",null,"Selected","Upcharge","Bass Spurs",null,null,null,0,0,0,0,0,0,0,0,0,0,0,0,null,null,null,null,{"$f":"+AL9","v":0},"18x20",null,null,null,null,{"$f":"+AL65","v":0},"5x14",null,{"$f":"+AL35+AL36","v":0},"7x6 and 8x6",null,{"$f":"SUM(CP7:CP9)","v":0},"Sum of conflict sizes",null,{"$f":"SUM(CS4:CS9)","v":0},"Sum of Conflict Sizes",null,"12x22",0,"LB822",{"$error":"#N/A"},{"$error":"#N/A"},{"$error":"#N/A"},{"$error":"#N/A"}," Cstm  ",{"$f":"CONCATENATE(CY10,CZ10,DA10,DB10,DC10)","v":{"$error":"#N/A"}},{"$f":"ISERROR(DD10)","v":true},{"$f":"IF(DE10=FALSE,DD10,\"\")","v":""},null,null,null,null,null,null,"P2306 Die Cast",20,null,null,null,null,null,null,null,null,null,null,null,null,null,null,null,"Lugs",{"$f":"HLOOKUP(1,BA5:BC8,4,FALSE)","v":{"$error":"#N/A"}},null,"Right Back Placement",{"$f":"IF(AV67=1,\"There\",\"Not There\")","v":"Not There"},null,"."]
[null,null,"14x22 Bass Drum",0,null,null,"54 Green Sparkle",null,null,null,null,"T \"T\"-Handles",null,null,null,"P2308 New Classic",null,null,null,null,null,null,null,null,null,null,null,null,null,null,null,null,"",null,null,null,"bd",0,false,0,"14x22",1512,null,0,"54 Green Sparkle",0,0,null,0,"54 Green Sparkle",null,{"$f":"IF(K11=\"\",0,1)","v":0},{"$f":"+AZ11*DN9","v":0},"T \"T\"-Handles",null,{"$f":"IF(O11=\"\",0,1)","v":0},null,"P2308 New Classic",null,{"$f":"IF(P15=\"\",0,1)","v":0},{"$f":"+BH11*0","v":0},"LR2974SP Elite Kick Spur",null,null,null,0,0,0,0,0,0,0,0,0,0,0,0,null,"Tom brackets that won't work with 10.5mm",null,null,{"$f":"+AL25","v":0},"12x14",null,null,null,null,{"$f":"+AL68","v":0},"5x14 8 Lug",null,{"$f":"+AL56","v":0},"12x15",null,null,null,null,null,null,null,"14x22",0,"LB842",{"$error":"#N/A"},{"$error":"#N/A"},{"$error":"#N/A"},{"$error":"#N/A"}," Cstm  ",{"$error":"#N/A"},true,"",null,null,null,null,"DM11",null,"Brass Hardware (Bass, Tom, Floor)",60,null,null,null,null,null,null,null,null,null,null,null,null,null,null,null,"Hardware Finish",{"$f":"VLOOKUP(1,AZ15:BB16,3,FALSE)","v":{"$error":"#N/A"}},null,"Clawhooks",{"$f":"VLOOKUP(1,BD10:BF12,3,FALSE)","v":{"$error":"#N/A"}},null,"."]
[null,null,"16x22 Bass Drum",0,null,null,"JW Jumbo White ",null,null,null,null,null,null,null,null,"PM0045 Keystone",null,null,null,null,null,null,null,null,null,null,null,null,null,null,null,null,"",null,null,null,"bd",0,false,0,"16x22",1512,null,0,"JW Jumbo White ",0,0,null,0,"JW Jumbo White ","Selected",{"$f":"SUM(AZ10:AZ11)","v":0},{"$f":"SUM(BA10:BA11)","v":0},"Upcharge",null,{"$f":"IF(O12=\"\",0,1)","v":0},null,"PM0045 Keystone",null,0,{"$f":"+BH12*0","v":0},"LR2973SP Rocker Rotating Spur",null,null,null,0,0,0,0,0,0,0,0,0,0,0,0,null,{"$f":"+BH24","v":0},"P1216D Classic Ludwig Bracket ",null,{"$f":"+AL26","v":0},"13x14",null,null,null,null,{"$f":"SUM(CJ8:CJ11)","v":0},"Sum of Conflict sizes",null,{"$f":"+AL57","v":0},"13x15",null,{"$f":"+CP10*CP5","v":0},"Error if > 0",null,{"$f":"+BH13","v":0},"LC1308SP Curved Spur",null,"16x22",0,"LB862",{"$error":"#N/A"},{"$error":"#N/A"},{"$error":"#N/A"},{"$error":"#N/A"}," Cstm  ",{"$error":"#N/A"},true,"",null,null,null,null,"DM12",null,"Brass Hardware (Snare)",60,null,null,null,null,null,null,null,null,null,null,null,null,null,null,null,"Tom Holder",{"$f":"VLOOKUP(1,AZ20:BC32,4,FALSE)","v":{"$error":"#N/A"}},null,"Tension Screws",{"$f":"VLOOKUP(1,AZ10:BB11,3,FALSE)","v":{"$error":"#N/A"}},null,"."]
[null,null,"18x22 Bass Drum",0,null,null,"36 Olive Sparkle",null,null,"PLATING CONFLICT",null,null,null,null,null,"Size / Spur Conflict",null,null,null,null,null,null,null,null,null,null,null,null,null,null,null,null,"",null,null,null,"bd",0,false,0,"18x22",1512,null,0,"36 Olive Sparkle",0,0,null,0,"36 Olive Sparkle",null,null,null,null,null,{"$f":"SUM(BD10:BD12)","v":0},{"$f":"SUM(BE10:BE12)","v":0},"Upcharge",null,0,{"$f":"+BH13*DN13","v":0},"LC1308SP Curved Spur",null,null,null,0,0,0,0,0,0,0,0,0,0,0,0,null,{"$f":"+BH25","v":0},"L_RL Vibraband w/ Ludwig Brkt",null,{"$f":"+AL27","v":0},"14x14",null,null,null,null,{"$f":"+CJ12*CJ6","v":0},"Error if > 0",null,{"$f":"+AL58","v":0},"14x15",null,null,null,null,{"$f":"+BH14","v":0},"LC1308SP2 2 Pr. Curved Spurs",null,"18x22",0,"LB882",{"$error":"#N/A"},{"$error":"#N/A"},{"$error":"#N/A"},{"$error":"#N/A"}," Cstm  ",{"$error":"#N/A"},true,"",null,null,null,null,"DM13",null,"1 pr Curved Spurs",30,null,null,null,null,null,null,null,null,null,null,null,null,null,null,null,"Right or Left Handed",{"$f":"IFERROR(VLOOKUP(1,AZ34:BC35,4,FALSE),\"\")","v":""},null,"Batter Head",{"$f":"VLOOKUP(1,AZ56:BA56,2,FALSE)","v":"PS3 Clear"},null,"."]
[null,null,"20x22 Bass Drum",0,null,null,"RP Red Oyster",null,null,"Hardware Finish",null,null,"Tom Tom Heads",null,null,"Bass Spurs",null,null,null,null,null,null,null,null,null,null,null,null,null,null,null,null,"",null,null,null,"bd",0,false,0,"20x22",1512,null,0,"RP Red Oyster",0,0,null,0,"RP Red Oyster",null,"Hardware Finish",null,null,"Codif","Tom Tom Heads",null,null,null,0,{"$f":"+BH14*DN14","v":0},"LC1308SP2 2 Pr. Curved Spurs",null,null,null,0,0,0,0,0,0,0,0,0,0,0,0,null,{"$f":"+BH28","v":0},"P1762B Modular Tom Bracket",null,{"$f":"+AL28","v":0},"13x15",null,null,null,null,null,null,null,{"$f":"SUM(CM10:CM13)","v":0},"sum of conflict sizes",null,null,null,null,{"$f":"SUM(CS12:CS13)","v":0},"Sum of Conflict Spurs",null,"20x22",0,"LB802",{"$error":"#N/A"},{"$error":"#N/A"},{"$error":"#N/A"},{"$error":"#N/A"}," Cstm  ",{"$error":"#N/A"},true,"",null,null,null,null,"DM14",null,"2 pr Curved Spurs",60,null,null,null,null,null,null,null,null,null,null,null,null,null,null,null,"Spurs",{"$f":"VLOOKUP(1,BH11:BJ16,3,FALSE)","v":{"$error":"#N/A"}},null,"Resonant Head",{"$f":"VLOOKUP(1,BE56:BF58,2,FALSE)","v":{"$error":"#N/A"}},null,"."]
[null,null,"12x24 Bass Drum",0,null,null,"27 Red Sparkle",null,null,null,"Chrome",null,null,"Double (top & bottom)",null,null,"LR2974SP Elite Kick Spur",null,null,null,null,null,null,null,null,null,null,null,null,null,null,null,{"$f":"IF(AN15>0,CONCATENATE(\"qty \",AN15,\") \",AO15,\"   \"),\"\")","v":""},null,null,null,"bd",0,false,0,"12x24",1582,null,0,"27 Red Sparkle",0,0,null,0,"27 Red Sparkle",null,{"$f":"IF(J15=\"\",0,1)","v":0},null,"Chrome"," ",{"$f":"IF(M15=\"\",0,1)","v":0},"Double (as God Intended)",null,null,0,{"$f":"BH15*DN15","v":0},"NSP No Spurs or Drilling",null,null,null,0,0,0,0,0,0,0,0,0,0,0,0,null,{"$f":"SUM(CA12:CA14)","v":0},"returns a 1 if <> 10.5mm",null,{"$f":"+AL29","v":0},"14x15",null,null,null,null,"Size vs. Lg Classic lugs.",null,null,null,null,null,null,null,null,null,null,null,"12x24",0,"LB824",{"$error":"#N/A"},{"$error":"#N/A"},{"$error":"#N/A"},{"$error":"#N/A"}," Cstm  ",{"$f":"CONCATENATE(CY15,CZ15,DA15,DB15,DC15)","v":{"$error":"#N/A"}},{"$f":"ISERROR(DD15)","v":true},{"$f":"IF(DE15=FALSE,DD15,\"\")","v":""},null,null,null,null,"DM15",null,"No Spurs or Drilling",0,null,null,null,null,null,null,null,null,null,null,null,null,null,null,null,"Shell Mount",{"$f":"VLOOKUP(1,AV61:AX63,3,FALSE)","v":{"$error":"#N/A"}},null,"Badge",{"$f":"VLOOKUP(1,AY46:BA49,3,FALSE)","v":{"$error":"#N/A"}},null,"."]
[null,null,"14x24 Bass Drum",0,null,null,"SP ShamPayne",null,null,null,"Brass",null,null,"Single (top only)",null,null,"LR2973SP Rocker Rotating Spur",null,null,null,null,null,null,null,null,null,null,null,null,null,null,null,"",null,null,null,"bd",0,false,0,"14x24",1582,null,0,"SP ShamPayne",0,0,null,0,"SP ShamPayne",null,{"$f":"IF(J16=\"\",0,1)","v":0},null,"Brass","B",{"$f":"IF(M16=\"\",0,1)","v":0},"Single (hippie rubbish)",null,null,0,{"$f":"BH16*DN16","v":0},"LAC2973SP Atlas Anchor",null,null,null,0,0,0,0,0,0,0,0,0,0,0,0,null,null,null,null,{"$f":"AL35+AL36","v":0},"7x6 & 8x6",null,null,null,null,{"$f":"+BB7","v":0},"Lg Classic Lugs (TT)",null,{"$f":"+CM14*CM8","v":0},"Error if >0",null,"Size vs. Finish",null,null,{"$f":"+CS14*CS10","v":0},"Error if > 0",null,"14x24",0,"LB844",{"$error":"#N/A"},{"$error":"#N/A"},{"$error":"#N/A"},{"$error":"#N/A"}," Cstm  ",{"$error":"#N/A"},true,"",null,null,null,null,"DM16",null,"LAC2973SP Atlas Anchor",0,null,null,null,null,null,null,null,null,null,null,null,null,null,null,null,null,null,null,null,null,null,"."]
[null,null,"16x24 Bass Drum",0,null,null,"1V Silver Glass Glitter",null,null,null,null,"Single head option on wrap finishes only",null,null,null,null,"LC1308SP Curved Spur",null,null,null,null,null,null,null,null,null,null,null,null,null,null,null,"",null,null,null,"bd",0,false,0,"16x24",1582,null,0,"1V Silver Glass Glitter",50,50,null,0,"1V Silver Glass Glitter","Selected",{"$f":"SUM(AZ15:AZ16)","v":0},null,null,null,{"$f":"SUM(BD15:BD16)","v":0},"Selected",null,"Selected",{"$f":"SUM(BH11:BH16)","v":0},{"$f":"SUM(BI11:BI16)","v":0},"Upcharge",null,null,null,{"$f":"AR17*AT17","v":0},0,0,0,0,0,0,0,0,0,0,0,null,{"$f":"IF(CA15*CA9>0,1,0)","v":0},"Returns a 1 if error",null,{"$f":"+AL37","v":0},"8x8",null,null,null,null,{"$f":"AL35","v":0},"7x6",null,null,null,null,null,"20\" deep bass vs exotics",null,null,null,null,"16x24",0,"LB864",{"$error":"#N/A"},{"$error":"#N/A"},{"$error":"#N/A"},{"$error":"#N/A"}," Cstm  ",{"$error":"#N/A"},true,"",null,null,null,null,null,null,"Tom Holders",null,null,null,null,null,null,null,null,null,null,null,null,null,null,null,null,{"$f":"IF(AN73=1,\"Tom Tom\",CONCATENATE(AN73,\" Tom Toms Chosen\"))","v":"0 Tom Toms Chosen"},"Check Main Page for Errors",null,null,null,null,"."]
[null,null,"18x24 Bass Drum",0,null,null,"0S Silver Sparkle",null,null,"(Bass Drum has Chrome Tom Holder)",null,null,null,null,null,null,"LC1308SP2 2 Pr. Curved Spurs",null,null,null,null,null,null,null,null,null,null,null,null,null,null,null,"",null,null,null,"bd",0,false,0,"18x24",1582,null,0,"0S Silver Sparkle",0,0,null,{"$f":"IF(H18=\"\",0,1)","v":0},"0S Silver Sparkle",null,null,null,null,null,null,null,null,null,null,null,null,null,null,null,0,0,0,0,0,0,0,0,0,0,0,0,null,null,null,null,{"$f":"+AL38","v":0},"7x8",null,null,null,null,{"$f":"+AL37","v":0},"7x8",null,null,null,null,{"$f":"+AL14","v":0},"20x22",null,null,null,null,"18x24",0,"LB884",{"$error":"#N/A"},{"$error":"#N/A"},{"$error":"#N/A"},{"$error":"#N/A"}," Cstm  ",{"$error":"#N/A"},true,"",null,null,null,null,"DM18",null,"P7184A Elite Bass Casting",25,null,null,null,null,null,null,null,null,null,null,null,null,null,null,null,{"$f":"+DI60","v":""},null,null,null,null,null,"."]
[null,null,"20x24 Bass Drum",0,null,null,"52 Sky Blue Pearl",null,null,null,"Tom Holder",null,"Holder/Lug Error",null,null,null,"NSP No Spurs or Drilling",null,null,null,null,null,null,null,null,null,null,null,null,null,null,null,"",null,null,null,"bd",0,false,0,"20x24",1582,null,0,"52 Sky Blue Pearl",0,0,null,0,"52 Sky Blue Pearl",null,"Selected","Upcharge",null,"Tom Holder",null,"codif",null,null,null,null,null,null,null,null,0,0,0,0,0,0,0,0,0,0,0,0,null,null,null,null,{"$f":"+AL39+AL40","v":0},"7x10 & 7.5x10",null,"Bass Hoops for Wrap Drums",null,null,{"$f":"+AL39+AL40","v":0},"7x10 & 7.5s10",null,"Size vs Throwoff",null,null,{"$f":"+AL19","v":0},"20x24",null,null,null,null,"20x24",0,"LB804",{"$error":"#N/A"},{"$error":"#N/A"},{"$error":"#N/A"},{"$error":"#N/A"}," Cstm  ",{"$error":"#N/A"},true,"",null,null,null,null,"DM19",null,"LR2991MT Elite Single Tom Holder",95,null,null,null,null,null,null,null,null,null,null,null,null,null,null,null,"Shell Type","Classic Maple, MPLTTCUSTOM",null,"Total Tom Toms",{"$f":"SUM(D35:D60)","v":0},null,"."]
[null,null,"12x26 Bass Drum",0,null,null,"37 Teal Blue Sparkle",null,null,null,null,"NMT Less Mount and Holder",null,null,null,null,"LAC2973SP Atlas Anchor",null,null,null,null,null,null,null,null,null,null,null,null,null,null,null,{"$f":"IF(AN20>0,CONCATENATE(\"qty \",AN20,\") \",AO20,\"   \"),\"\")","v":""},null,null,null,"bd",0,false,0,"12x26",1636,null,0,"37 Teal Blue Sparkle",0,0,null,0,"37 Teal Blue Sparkle",null,{"$f":"IF(K20=\"\",0,1)","v":0},0,{"$f":"+AZ20*BA20","v":0},"NMT Less Mount and Holder",null,"XX",null,null,null,null,null,null,null,null,0,0,0,0,0,0,0,0,0,0,0,0,null,"9.5mm Tom Holder",null,null,{"$f":"+AL41","v":0},"8x10",null,{"$f":"+AR59","v":0},"STi Satin Black w/Inlay",null,{"$f":"SUM(CJ17:CJ19)","v":0},"Sum of Conflict Sizes",null,{"$f":"+BD46","v":0},"P85 Supraphonic",null,{"$f":"SUM(CP18:CP19)","v":0},"Sum of Conflict Sizes",null,"Throwoff vs. Butt",null,null,"12x26",0,"LB826",{"$error":"#N/A"},{"$error":"#N/A"},{"$error":"#N/A"},{"$error":"#N/A"}," Cstm  ",{"$f":"CONCATENATE(CY20,CZ20,DA20,DB20,DC20)","v":{"$error":"#N/A"}},{"$f":"ISERROR(DD20)","v":true},{"$f":"IF(DE20=FALSE,DD20,\"\")","v":""},null,null,null,null,"DM20",null,"LR2992MT Classic Double Tom Holder",100,null,null,null,null,null,null,null,null,null,null,null,null,null,null,null,"Drum Type","Tom Tom",null,"Double/Single Heads",{"$f":"IF(BD16=1,\"SINGLE HEAD\",\"Double Head\")","v":"Double Head"},null,"."]
[null,null,"14x26 Bass Drum",0,null,null,"1Q Vintage Black Oyster",null,null,null,null,{"$f":"IF(AZ16=1, \"P7184A CHROME Elite Casting\", \"P7184A Elite Bass Casting\")","v":"P7184A Elite Bass Casting"},null,null,null,"Size vs. Vibraband Conflict",null,null,null,null,null,null,null,null,null,null,null,null,null,null,null,null,"",null,null,null,"bd",0,false,0,"14x26",1636,null,0,"1Q Vintage Black Oyster",50,50,null,0,"1Q Vintage Black Oyster",null,0,{"$f":"DN18","v":25},{"$f":"+AZ21*BA21","v":0},{"$f":"IF(AZ16=1, \"CHROME Elie Casting\", \"P7184A Elite Bass Casting\")","v":"P7184A Elite Bass Casting"},null,"EX",null,null,null,null,null,null,null,null,0,0,0,0,0,0,0,0,0,0,0,0,null,{"$f":"+AZ25","v":0},"LR2981MT Rocker Single Tom Holder",null,{"$f":"+AL42","v":0},"9x10",null,0,"SNi Satin Natural w/Inlay",null,{"$f":"+CJ20*CJ16","v":0},"Error if > 0",null,{"$f":"+BD47","v":0},"P86 Millennium",null,null,null,null,null,null,null,"14x26",0,"LB846",{"$error":"#N/A"},{"$error":"#N/A"},{"$error":"#N/A"},{"$error":"#N/A"}," Cstm  ",{"$error":"#N/A"},true,"",null,null,null,null,"DM21",null,"P1610D Ludwig Bass Casting ",50,null,null,null,null,null,null,null,null,null,null,null,null,null,null,null,"Size",{"$f":"AG78","v":""},null,null,null,null,"."]
[null,null,"16x26 Bass Drum",0,null,null,"2Q Vintage Blue Oyster",null,null,null,null,{"$f":"IF(AZ16=1, \"LR2991MT CHROME Elite Single\", \"LR2991MT Elite Single Tom Holder\")","v":"LR2991MT Elite Single Tom Holder"},null,null,"TOM HOLDER / BRACKET CONFLICT",null,null,null,null,null,null,null,null,null,null,null,null,null,null,null,null,null,"",null,null,null,"bd",0,false,0,"16x26",1636,null,0,"2Q Vintage Blue Oyster",0,0,null,0,"2Q Vintage Blue Oyster",null,0,95,{"$f":"+AZ22*BA22","v":0},{"$f":"IF(AZ16=1, \"CHROME Elite Single\",  \"LR2991MT Elite Single Tom Holder\")","v":"LR2991MT Elite Single Tom Holder"},null,"ES",null,null,"Tom Bracket",null,null,null,"codif",null,0,0,0,0,0,0,0,0,0,0,0,0,null,{"$f":"+AZ26","v":0},"LR2980MT Rocker Double Tom Holder",null,{"$f":"+AL51","v":0},"10x14",null,0,"ST Satin Black",null,null,null,null,{"$f":"SUM(CM20:CM21)","v":0},"Sum of conflict strainers",null,{"$f":"+AR47","v":0},"50 Birdseye Maple",null,{"$f":"SUM(BD46:BD48)","v":0},"P85/P86/P80",null,"16x26",0,"LB866",{"$error":"#N/A"},{"$error":"#N/A"},{"$error":"#N/A"},{"$error":"#N/A"}," Cstm  ",{"$error":"#N/A"},true,"",null,null,null,null,"DM22",null,"LR2981MT Rocker Single Tom Holder",95,null,null,null,null,null,null,null,null,null,null,null,null,null,null,null,"Finish",{"$f":"EE7","v":{"$error":"#N/A"}},null,"Tone Control",{"$f":"VLOOKUP(1,AZ39:BB40,3,FALSE)","v":{"$error":"#N/A"}},null,"."]
[null,null,"Unused",0,null,null,"NS Vintage Nickel Sparkle",null,null,null,null,{"$f":"IF(AZ16=1, \"LR2992MT CHROME Classic Double\",  \"LR2992MT Classic Double Tom Holder\")","v":"LR2992MT Classic Double Tom Holder"},null,null,null,"Tom Bracket",null,null,null,null,null,null,null,null,null,null,null,null,null,null,null,null,{"$f":"IF(AN23>0,CONCATENATE(\"qty \",AN23,\") \",AO23,\"   \"),\"\")","v":""},null,null,null,"bd",0,false,0,"14x28",1795,null,0,"NS Vintage Nickel Sparkle",0,0,null,0,"NS Vintage Nickel Sparkle",null,0,100,0,{"$f":"IF(AZ16=1, \"CHROME Classic Double\", \"LR2992MT Classic Double Tom Holder\")","v":"LR2992MT Classic Double Tom Holder"},null,"EH",null,null,{"$f":"IF(P24=\"\",0,1)","v":0},{"$f":"+BH23*0","v":0},"NBKT No Mounting Bracket",null,"XX",null,0,0,0,0,0,0,0,0,0,0,0,0,null,{"$f":"+AZ31","v":0},"LR2983MT Rail Consolette 9.5mm",null,0,"11x14",null,0,"SN Satin Natural",null,"Size vs. Long Lugs",null,null,null,null,null,{"$f":"+AR48","v":0},"53 African Bubinga",null,{"$f":"SUM(BJ49:BJ50)","v":0},"P70/P71",null,"14x28",0,"LB8428",{"$error":"#N/A"},{"$error":"#N/A"},{"$error":"#N/A"},{"$error":"#N/A"}," Cstm  ",{"$f":"CONCATENATE(CY23,CZ23,DA23,DB23,DC23)","v":{"$error":"#N/A"}},{"$f":"ISERROR(DD23)","v":true},"",null,null,null,null,"DM23",null,"LR2980MT Rocker Double Tom Holder",120,null,null,null,null,null,null,null,null,null,null,null,null,null,null,null,"Lugs",{"$f":"HLOOKUP(1,BA7:BC8,2,FALSE)","v":{"$error":"#N/A"}},null,"Batter Head",{"$f":"VLOOKUP(1,AZ58:BA60,2,FALSE)","v":{"$error":"#N/A"}},null,"."]
[null,null,"Unused",0,null,null,"NM Vintage White Marine",null,null,null,null,{"$f":"IF(AZ16=1, \"P1610D CHROME Ludwig Casting\", \"P1610D Ludwig Bass Casting\")","v":"P1610D Ludwig Bass Casting"},null,null,null,null,"NBKT No Mounting Bracket",null,null,null,null,null,null,null,null,null,null,null,null,null,null,null,"",null,null,null,"bd",0,false,0,"16x28",1795,null,0,"NM Vintage White Marine",0,0,null,0,"NM Vintage White Marine",null,0,50,0,{"$f":"IF(AZ16=1, \"CHROME Ludwig Casting\", \"P1610D Ludwig Bass Casting\")","v":"P1610D Ludwig Bass Casting"},null,"LX",null,null,0,{"$f":"+BH24*DN38","v":0},"P1216D Classic Ludwig Bracket ",null,"LM",null,0,0,0,0,0,0,0,{"$f":"+$BA$12 + $BE$13","v":0},0,0,0,0,null,{"$f":"SUM(CA21:CA23)","v":0},"returns a 1 if 9.5mm tom holder",null,0,"12x14",null,0,"0Ti Sable Black w/Matching Inlay",null,{"$f":"+BC7","v":0},"Long Lugs (tt)",null,{"$f":"+AL62","v":0},"3Hx13",null,{"$f":"+AR55","v":0},"68 Quilted Makore",null,{"$f":"+CS23*CS22","v":0},"Error if > 0",null,"16x28",0,"LB8628",{"$error":"#N/A"},{"$error":"#N/A"},{"$error":"#N/A"},{"$error":"#N/A"}," Cstm  ",{"$error":"#N/A"},true,"",null,{"$f":"CONCATENATE(DF3,DF4,DF5,DF6,DF7,DF8,DF9,DF10,DF11,DF12,DF13,DF14,DF15,DF16,DF17,DF18,DF19,DF20,DF21,DF22,DF23,DF24)","v":""},null,null,"DM24",null,"LAC2983MT Atlas Arch Single",150,null,null,null,null,null,null,null,null,null,null,null,null,null,null,null,"Hardware Finish",{"$f":"+EE11","v":{"$error":"#N/A"}},null,"Resonant Head",{"$f":"IF(BD16=1,\"No Reso Head\",VLOOKUP(1,BE60:BF60,2,FALSE))","v":"Clear Ambassador"},null,"."]
["M P L F T C U S T O M",null,"12x14 Floor Tom",0,null,null,"0F White Cortex",null,null,null,null,{"$f":"IF(AZ16=1, \"LR2981MT CHROME Rocker Single\",  \"LR2981MT Rocker Single Tom Holder\")","v":"LR2981MT Rocker Single Tom Holder"},null,null,null,null,"P1216D Classic Ludwig Bracket ",null,null,null,null,null,null,null,null,null,null,null,null,null,null,null,"",null,null,null,"ft",0,false,0,"12x14",845,null,0,"0F White Cortex",0,0,null,0,"0F White Cortex",null,0,95,0,{"$f":"IF(AZ16=1, \"CHROME Rocker Single\",  \"LR2981MT Rocker Single Tom Holder\")","v":"LR2981MT Rocker Single Tom Holder"},null,"LS",null,null,0,{"$f":"+BH25*DN39","v":0},"L_RL Vibraband w/ Ludwig Brkt",null,"XX",null,0,0,0,{"$f":"+$BH$6","v":0},{"$f":"+$BI$39","v":0},{"$f":"+$BA$41","v":0},null,null,0,0,null,0,null,null,null,null,0,"13x14",null,0,"0Ni Natural w/Matching Inlay",null,{"$f":"AL35","v":0},"7x6",null,{"$f":"+AL64","v":0},"3Hx14",null,{"$f":"SUM(CP22:CP24)","v":0},"Sum of Conflict Finishes",null,null,null,null,"12x14",0,"LF824",{"$error":"#N/A"},{"$f":"VLOOKUP(1,$BH$35:$BL$38,5,FALSE)","v":{"$error":"#N/A"}},{"$error":"#N/A"},{"$f":"IF($CZ$73=1,\"\",VLOOKUP(1,$CZ$74:$DA$75,2,FALSE))","v":{"$error":"#N/A"}}," Cstm  ",{"$error":"#N/A"},true,"",null,null,null,null,"DM25",null,"PM0062MT",50,null,null,null,null,null,null,null,null,null,null,null,null,null,null,null,"Tom Bracket",{"$f":"VLOOKUP(1,BH23:BJ28,3,FALSE)","v":{"$error":"#N/A"}},null,"badge",{"$f":"IF((BH24+BH26)*AN73>0,CONCATENATE(EH15,\" (X2)\"),EH15)","v":{"$error":"#N/A"}},null,"."]
[null,null,"13x14 Floor Tom",0,null,null,"0P White Marine Pearl",null,null,null,null,{"$f":"IF(AZ16=1, \"LR2980MT CHROME Rocker Double\", \"LR2980MT Rocker Double Tom Holder\")","v":"LR2980MT Rocker Double Tom Holder"},null,null,null,null,"L_RL Vibraband w/ Ludwig Brkt",null,null,null,null,null,null,null,null,null,null,null,null,null,null,null,"",null,null,null,"ft",0,false,0,"13x14",845,null,0,"0P White Marine Pearl",0,0,null,0,"0P White Marine Pearl",null,0,120,0,{"$f":"IF(AZ16=1, \"CHROME Rocker Double\", \"LR2980MT Rocker Double Tom Holder\")","v":"LR2980MT Rocker Double Tom Holder"},null,"LH",null,null,0,{"$f":"+BH26*DN40","v":0},"P7202A Keystone Tom Bracket",null,"KM",null,0,0,0,0,0,0,null,null,0,0,null,0,null,"Tom brackets that won't work with 9.5mm",null,null,0,"14x14",null,0,"0Ta Sable Black w/Accent Inlay",null,{"$f":"+AL37","v":0},"7x8",null,{"$f":"SUM(CM24:CM25)","v":0},"Sum of conflict sizes",null,null,null,null,{"$f":"+BD49","v":0},"P70",null,"13x14",0,"LF834",{"$error":"#N/A"},{"$f":"VLOOKUP(1,$BH$35:$BL$38,5,FALSE)","v":{"$error":"#N/A"}},{"$error":"#N/A"},{"$error":"#N/A"}," Cstm  ",{"$error":"#N/A"},true,"",null,null,null,null,"DM26",null,"LAP2984MT Atlas Double",153,null,null,null,null,null,null,null,null,null,null,null,null,null,null,null,null,null,null,null,null,null,"."]
[null,null,"14x14 Floor Tom",0,null,null,"Unused",null,null,null,null,{"$f":"IF(AZ16=1, \"LAC2983MT CHROME Atlas Arch\",  \"LAC2983MT Atlas Arch Single\")","v":"LAC2983MT Atlas Arch Single"},null,null,null,null,"P7202A Keystone Tom Bracket",null,null,null,null,null,null,null,null,null,null,null,null,null,null,null,"",null,null,null,"ft",0,false,0,"14x14",845,null,0,"Unused",0,0,null,0,null,null,0,150,0,{"$f":"IF(AZ16=1, \"CHROME Atlas Arch\", \"LAC2983MT Atlas Arch Single\")","v":"LAC2983MT Atlas Arch Single"},null,"AA",null,null,0,{"$f":"+BH27*DN41","v":0},"L_RK Vibraband w/ Keystone Bracket",null,"XX",null,0,0,0,0,0,0,null,null,0,0,null,0,null,{"$f":"+BH28","v":0},"P1762B Modular Tom Bracket",null,0,"12x15",null,0,"0Na Natural w/Accent Inlay",null,{"$f":"+AL39+AL40","v":0},"7x10 & 7.5x10",null,null,null,null,{"$f":"+CP25*CP20","v":0},"Error if > 0",null,{"$f":"+BJ47+BJ48+BJ50","v":0},"P32/P33/P71",null,"14x14",0,"LF844",{"$error":"#N/A"},{"$error":"#N/A"},{"$error":"#N/A"},{"$error":"#N/A"}," Cstm  ",{"$error":"#N/A"},true,"",null,null,null,null,"DM27",null,"LAP2985MT Atlas Single",123,null,null,null,null,null,null,null,null,null,null,null,null,null,null,null,{"$f":"IF(AN72=1,\"Floor Tom\",CONCATENATE(AN72,\" Floor Toms Chosen\"))","v":"0 Floor Toms Chosen"},"Check Main Page for Errors",null,null,null,null,"."]
[null,null,"13x15 Floor Tom",0,null,null,"Unused",null,null,null,null,{"$f":"IF(AZ16=1, \"PM0062MT CHROME Atlas Bracket\",  \"PM0062MT Atlas Bass Casting\")","v":"PM0062MT Atlas Bass Casting"},null,null,null,null,"L_RK Vibraband w/ Keystone Bracket",null,null,null,null,null,null,null,null,null,null,null,null,null,null,null,"",null,null,null,"ft",0,false,0,"13x15",874,null,0,"Unused",0,0,null,0,null,null,0,50,0,{"$f":"IF(AZ16=1, \"CHROME Atlas Bracket\", \"PM0062MT Atlas Bracket\")","v":"PM0062MT Atlas Bracket"},null,"AX",null,null,0,{"$f":"+BH28*DN42","v":0},"PM0046 Atlas Tom Bracket",null,"AM",null,0,0,0,0,0,0,null,null,0,0,null,0,null,null,null,null,0,"13x15",null,0,"FF Full Width Wrap",null,{"$f":"SUM(CJ25:CJ27)","v":0},"Sum of Conflict Sizes",null,{"$f":"+CM26*CM22","v":0},"Error if > 0",null,null,null,null,{"$f":"+CS27*CS26","v":0},"Error if > 0",null,"13x15",0,"LF835",{"$error":"#N/A"},{"$error":"#N/A"},{"$error":"#N/A"},{"$error":"#N/A"}," Cstm  ",{"$error":"#N/A"},true,"",null,null,null,null,"DM28",null,"LR2983MT Rail Consolette 9.5mm",110,null,null,null,null,null,null,null,null,null,null,null,null,null,null,null,{"$f":"+DH34","v":""},null,null,null,null,null,"."]
[null,null,"14x15 Floor Tom",0,null,null,"Unused",null,null,null,null,{"$f":"IF(AZ16=1, \"LAP2984MT CHROME Atlas Double\", \"LAP2984MT Atlas Double\")","v":"LAP2984MT Atlas Double"},null,null,null,null,"PM0046 Atlas Tom Bracket",null,null,null,null,null,null,null,null,null,null,null,null,null,null,null,"",null,null,null,"ft",0,false,0,"14x15",874,null,0,"Unused",0,0,null,0,null,null,{"$f":"IF(K29=\"\",0,1)","v":0},153,{"$f":"+AZ29*BA29","v":0},{"$f":"IF(AZ16=1, \"CHROME Atlas Double\", \"LAP2984MT Atlas Double\")","v":"LAP2984MT Atlas Double"},null,"A2",null,null,null,null,null,null,null,null,0,0,0,0,0,0,null,null,0,0,null,0,null,{"$f":"IF(CA27*CA24>0,1,0)","v":0},"Returns a 1 if error",null,0,"14x15",null,0,"FFa Full Width Accent ",null,{"$f":"+CJ28*CJ24","v":0},"Error if > 0",null,null,null,null,null,"Steinway finish snares",null,null,null,null,"14x15",0,"LF845",{"$error":"#N/A"},{"$error":"#N/A"},{"$error":"#N/A"},{"$error":"#N/A"}," Cstm  ",{"$error":"#N/A"},true,"",null,null,null,null,"DM29",null,"LR2993MT Rail Consolette 10.5mm",110,null,null,null,null,null,null,null,null,null,null,null,null,null,null,null,"Shell Type","Classic Maple, MPLFTCUSTOM",null,"Total Floor Toms",{"$f":"SUM(D25:D34)","v":0},null,"."]
[null,null,"13x16 Floor tom",0,null,null,"AB Aqua Burst",null,null,null,null,{"$f":"IF(AZ16=1, \"LAP2985MT CHROME Atlas Single\",  \"LAP2985MT Atlas Single\")","v":"LAP2985MT Atlas Single"},null,null,"TOM BRACKET/FT LEG MIS-MATCH",null,null,null,null,null,null,null,null,null,null,null,null,null,null,null,null,null,"",null,null,null,"ft",0,false,0,"13x16",874,null,0,"AB Aqua Burst",50,50,null,0,null,null,{"$f":"IF(K30=\"\",0,1)","v":0},123,{"$f":"+AZ30*BA30","v":0},{"$f":"IF(AZ16=1, \"CHROME Atlas Single\",  \"LAP2985MT Atlas Single\")","v":"LAP2985MT Atlas Single"},null,"A1",null,null,null,null,null,null,null,null,0,0,0,0,0,0,null,null,0,0,null,0,null,null,null,null,0,"14x16",null,null,"MH Matching Hoop",null,null,null,null,{"$f":"+BD49","v":0},"P70 SuperSensitive",null,null,null,null,{"$f":"+BD50","v":0},"P71",null,"13x16",0,"LF836",{"$error":"#N/A"},{"$error":"#N/A"},{"$error":"#N/A"},{"$error":"#N/A"}," Cstm  ",{"$error":"#N/A"},true,"",null,null,null,null,null,null,null,null,null,null,null,null,null,null,null,null,null,null,null,null,null,null,null,"Drum Type","Floor Tom",null,null,null,null,"."]
[null,null,"14x16 Floor Tom",0,null,null,"BN Burnt Natural",null,null,null,null,{"$f":"IF(AZ16=1, \"LR2983MT CHROME Rail 9.5mm\",  \"LR2983MT Rail Consolette 9.5mm\")","v":"LR2983MT Rail Consolette 9.5mm"},null,null,null,null,"Lug/Bracket Error",null,null,null,null,null,null,null,null,null,null,null,null,null,null,null,"",null,null,null,"ft",0,false,0,"14x16",874,null,0,"BN Burnt Natural",50,50,null,0,null,null,{"$f":"IF(K31=\"\",0,1)","v":0},{"$f":"DN28","v":110},{"$f":"+AZ31*BA31","v":0},{"$f":"IF(AZ16=1, \"CHROME Rail 9.5mm\",  \"LR2983MT Rail Consolette 9.5mm\")","v":"LR2983MT Rail Consolette 9.5mm"},null,"RC",null,"Selected",{"$f":"SUM(BH23:BH29)","v":0},{"$f":"SUM(BI23:BI29)","v":0},"Upcharge",null,null,null,0,0,0,0,0,0,null,null,0,0,null,0,null,"12mm Atlas Tom Holder",null,null,0,"16x16",null,{"$f":"+AR70","v":0},"0T Sable Hoop",null,null,null,null,null,null,null,{"$f":"+AR51","v":0},"57 Black Cherry",null,{"$f":"SUM(BJ47:BJ49)","v":0},"P32/P33/P70",null,"14x16",0,"LF846",{"$error":"#N/A"},{"$error":"#N/A"},{"$error":"#N/A"},{"$error":"#N/A"}," Cstm  ",{"$error":"#N/A"},true,"",null,null,null,null,"DM31",null,"Shell Mount Cymbal Holder (Each)",106,null,null,null,null,null,null,null,null,null,null,null,null,null,null,null,"Size",{"$f":"AG77","v":""},null,null,null,null,"."]
[null,null,"15x16 Floor Tom",{"$f":"+AN32*(AP32+BY32)","v":0},null,null,"0Y Charcoal Shadow",null,null,null,null,{"$f":"IF(AZ16=1, \"LR2993MT CHROME Rail 10.5mm\", \"LR2993MT Rail Consolette 10.5mm\")","v":"LR2993MT Rail Consolette 10.5mm"},null,null,null,"Floor Tom Legs",null,null,null,null,null,null,null,null,null,null,null,null,null,null,null,null,"",null,null,null,"ft",0,false,0,"15x16",874,null,0,"0Y Charcoal Shadow",50,50,null,0,null,null,{"$f":"IF(K32=\"\",0,1)","v":0},{"$f":"DN29","v":110},{"$f":"+AZ32*BA32","v":0},{"$f":"IF(AZ16=1, \"CHROME Rail 10.5mm\", \"LR2993MT Rail Consolette 10.5mm\")","v":"LR2993MT Rail Consolette 10.5mm"},null,"RC",null,null,null,null,null,null,null,null,0,0,0,0,0,0,null,null,0,0,null,0,null,{"$f":"+AZ27","v":0},"LAC2983MT Atlas Arch Single",null,0,"6x12",null,{"$f":"+AR71","v":0},"0N Natural Hoop",null,"Size vs. Small Twin",null,null,{"$f":"+AL61","v":0},"6x12",null,0,"58 Black Walnut",null,{"$f":"+CS31*CS30","v":0},"Error if > 0",null,"15x16",0,"LF856",{"$error":"#N/A"},{"$error":"#N/A"},{"$error":"#N/A"},{"$error":"#N/A"}," Cstm  ",{"$error":"#N/A"},true,"",null,null,null,null,null,null,null,null,null,null,null,null,null,null,null,null,null,null,null,null,null,null,null,"Finish",{"$f":"+EE7","v":{"$error":"#N/A"}},null,"Tone Control",{"$f":"+EH22","v":{"$error":"#N/A"}},null,"."]
[null,null,"16x16 Floor Tom",0,null,null,"0L Cherry Stain",null,null,null,null,null,null,null,null,null,"LC5023TL Ludwig Floor Tom Legs",null,null,null,null,null,null,null,null,null,null,null,null,null,null,null,"",null,null,null,"ft",0,false,0,"16x16",874,null,0,"0L Cherry Stain",50,50,null,0,null,null,{"$f":"SUM(AZ20:AZ32)","v":0},"Selected",{"$f":"SUM(BB20:BB32)","v":0},null,null,null,null,null,null,null,null,null,null,null,0,0,0,0,0,0,null,null,0,0,null,0,null,{"$f":"+AZ29","v":0},"LAP2984MT Atlas Double",null,0,"3Hx13",null,{"$f":"+AR72","v":0},"STa Satin Black w/Accent",null,{"$f":"+BD4","v":0},"Small Twin (SD)",null,{"$f":"+AL62","v":0},"3Hx13",null,0,"59 So Am Mahogany",null,null,null,null,"16x16",0,"LF866",{"$error":"#N/A"},{"$error":"#N/A"},{"$error":"#N/A"},{"$error":"#N/A"}," Cstm  ",{"$error":"#N/A"},true,"",null,null,null,null,null,null,"Floor Tom Legs",null,null,null,null,null,null,null,null,null,null,null,null,null,null,null,null,"Lugs",{"$f":"HLOOKUP(1,BA6:BC8,3,FALSE)","v":{"$error":"#N/A"}},null,"Batter Head",{"$f":"VLOOKUP(1,AZ58:BA60,2,FALSE)","v":{"$error":"#N/A"}},null,"."]
[null,null,"16x18 Floor Tom",0,null,null,"RN Golden Slumbers",null,null,null,null,"Right Handed",null,null,null,null,"LC7202TL Keystone Floor Tom Legs",null,null,null,null,null,null,null,null,null,null,null,null,null,null,null,"",null,null,null,"ft",0,false,0,"16x18",1034,null,0,"RN Golden Slumbers",50,50,null,0,null,null,{"$f":"IF(K34=\"\",0,1)","v":0},null,null,null,null,null,null,null,"Floor Tom Legs",null,null,null,"codif",null,0,0,0,0,0,0,null,null,0,0,null,0,null,{"$f":"+AZ30","v":0},"LAP2985MT Atlas Single",null,0,"6x13",null,{"$f":"+AR73","v":0},"SNa Satin Natural w/Accent",null,null,null,null,{"$f":"+AL63","v":0},"6x13",null,0,"63 Pearwood",null,{"$f":"IF(SUM(CS32,CS28,CS24)>0,1,0)","v":0},"Returns a 1 if ANY error",null,"16x18",0,"LF868",{"$error":"#N/A"},{"$error":"#N/A"},{"$error":"#N/A"},{"$error":"#N/A"}," Cstm  ",{"$error":"#N/A"},true,"",null,{"$f":"CONCATENATE(DF25,DF26,DF27,DF28,DF29,DF30,DF31,DF32,DF33,DF34)","v":""},null,null,"DM34",null,"LTL No Legs or Brackets",0,null,null,null,null,null,null,null,null,null,null,null,null,null,null,null,"Hardware Finish",{"$f":"+EE11","v":{"$error":"#N/A"}},null,"Resonant Head",{"$f":"VLOOKUP(1,BE60:BF60,2,FALSE)","v":"Clear Ambassador"},null,"."]
["M P L T T C U S T O M",null,"7x6 Tom Tom ",0,null,null,"0M Mahogany Stain",null,null,null,null,"Left Handed",null,null,null,null,"LTL No Legs or Brackets",null,null,null,null,null,null,null,null,null,null,null,null,null,null,null,{"$f":"IF(AN35>0,CONCATENATE(\"qty \",AN35,\") \",AO35,\"   \"),\"\")","v":""},null,null,null,"tt",0,false,0,"7x6",502,null,0,"0M Mahogany Stain",50,50,null,0,null,null,{"$f":"IF(K35=\"\",0,1)","v":0},null,null,"Right Handed",null,null,null,null,{"$f":"IF(P33=\"\",0,1)","v":0},{"$f":"+BH35*0","v":0},"LC5023TL Ludwig Floor Tom Legs",null,"LX",null,0,0,{"$f":"+$BN$72","v":0},{"$f":"+$BH$7","v":0},{"$f":"+$BI$31","v":0},0,null,null,0,{"$f":"IF($BH$24+$BH$26>0,$AZ$51*2,$AZ$51)","v":0},null,0,null,{"$f":"IF(SUM(CA32,CA33,CA34)>0,1,0)","v":0},"returns a 1 if ATLAS 12mm",null,0,"3Hx14",null,{"$f":"IF(AND(SUM(CG5:CG16)>0,SUM(CG20:CG34)>0)=TRUE,1,0)","v":0},"1 if Spray drum w/Wrap Hoop",null,{"$f":"+AL67","v":0},"8x14",null,{"$f":"+AL64","v":0},"3Hx14",null,0,"65 Pomele Sapele",null,null,null,null,"7x6",0,{"$f":"IF(BD16=1,\"LTS876\",\"LT876\")","v":"LT876"},{"$error":"#N/A"},{"$f":"VLOOKUP(1,$BH$23:$BL$29,5,FALSE)","v":{"$error":"#N/A"}},{"$f":"LEFT(VLOOKUP(1,$AR$3:$AS$56,2,FALSE),2)","v":{"$error":"#N/A"}},{"$f":"IF($BA$7=1,\"\",VLOOKUP(1,$DB$74:$DD$75,2,FALSE))","v":{"$error":"#N/A"}},{"$f":"IF($BA$7+$CM$8=2,\"WR\",\"R\")","v":"R"},{"$f":"IF($AZ$16=1,\"B Cstm  \",\" Cstm  \"  )","v":" Cstm  "},{"$f":"IF($CM$8=1,CONCATENATE(CY35,CZ35,DA35,DB35,DC35,DD35),CONCATENATE(CY35,CZ35,DA35,DB35,DD35))","v":{"$error":"#N/A"}},{"$f":"ISERROR(DE35)","v":true},{"$f":"IF(DF35=FALSE,DE35,\"\")","v":""},null,null,null,"DM35",null,"PM0046 Atlas Floor Tom Legs",0,null,null,null,null,null,null,null,null,null,null,null,null,null,null,null,"Legs",{"$f":"VLOOKUP(1,BH35:BJ38,3,FALSE)","v":{"$error":"#N/A"}},null,"badge",{"$f":"+EH15","v":{"$error":"#N/A"}},null,"."]
[null,null,"8x6 Tom Tom",0,null,null,"0N Natural Maple",null,null,null,null,null,null,null,null,null,"PM0046  Atlas Floor Tom Legs",null,null,null,null,null,null,null,null,null,null,null,null,null,null,null,"",null,null,null,"tt",0,false,0,"8x6",502,null,0,"0N Natural Maple",50,50,null,0,null,null,null,null,null,"Left Handed",null,null,null,null,{"$f":"IF(P34=\"\",0,1)","v":0},{"$f":"+BH36*0","v":0},"LC7202TL Keystone Floor Tom Legs",null,"KX",null,0,0,0,{"$f":"+$BH$7","v":0},0,0,null,null,0,0,null,0,null,"Tom brackets that won't work w/ATLAS",null,null,{"$f":"+AL67","v":0},"8x14",null,null,null,null,{"$f":"+CJ35*CJ33","v":0},"Error if >0",null,{"$f":"+AL66","v":0},"6Hx14",null,0,"66 East Indian Rosewood",null,null,null,null,"8x6",0,{"$f":"IF(BD16=1,\"LTS886\",\"LT886\")","v":"LT886"},{"$f":"VLOOKUP(1,CW36:CX36,2,FALSE)","v":{"$error":"#N/A"}},{"$f":"VLOOKUP(1,$BH$23:$BL$29,5,FALSE)","v":{"$error":"#N/A"}},{"$error":"#N/A"},{"$error":"#N/A"},"R"," Cstm  ",{"$f":"IF($CM$8=1,CONCATENATE(CY36,CZ36,DA36,DB36,DC36,DD36),CONCATENATE(CY36,CZ36,DA36,DB36,DD36))","v":{"$error":"#N/A"}},{"$f":"ISERROR(DE36)","v":true},{"$f":"IF(DF36=FALSE,DE36,\"\")","v":""},null,null,null,null,null,null,null,null,null,null,null,null,null,null,null,null,null,null,null,null,null,null,null,null,null,null,null,null,"."]
[null,null,"7x8 Tom Tom",0,null,null,"0T Sable Classic Coat",null,null,null,null,null,null,null,null,null,"Lug/Leg Error",null,null,null,null,null,null,null,null,null,null,null,null,null,null,null,"",null,null,null,"tt",0,false,0,"7x8",508,null,0,"0T Sable Classic Coat",50,50,null,0,null,null,null,null,null,null,null,null,null,null,{"$f":"IF(P35=\"\",0,1)","v":0},{"$f":"BH37*DN34","v":0},"LTL No Legs or Brackets",null,"XX",null,0,0,0,0,0,0,null,null,0,0,null,0,null,{"$f":"+BH24","v":0},"P1216D Classic Ludwig Bracket ",null,{"$f":"+AL68","v":0},"5x14 8 Lug",null,"Wrap Finishes",null,null,null,null,null,{"$f":"+AL67","v":0},"8x14",null,{"$f":"SUM(CP31:CP36)","v":0},"sum of conflict finishes",null,null,null,null,"8x8",0,{"$f":"IF(BD16=1,\"LTS888\",\"LT888\")","v":"LT888"},{"$error":"#N/A"},{"$f":"VLOOKUP(1,$BH$23:$BL$29,5,FALSE)","v":{"$error":"#N/A"}},{"$error":"#N/A"},{"$error":"#N/A"},"R"," Cstm  ",{"$f":"IF($CM$8=1,CONCATENATE(CY37,CZ37,DA37,DB37,DC37,DD37),CONCATENATE(CY37,CZ37,DA37,DB37,DD37))","v":{"$error":"#N/A"}},{"$f":"ISERROR(DE37)","v":true},{"$f":"IF(DF37=FALSE,DE37,\"\")","v":""},null,null,null,null,null,"Tom Tom Brackets",null,null,null,null,null,null,null,null,null,null,null,null,null,null,null,null,{"$f":"IF(AN74=1,\"Snare Drum\",CONCATENATE(AN74,\" Snare Drums Chosen\"))","v":"0 Snare Drums Chosen"},"Check Main Page for Errors",null,null,null,null,"."]
[null,null,"8x8 Tom Tom",0,null,null,"SY Satin Charcoal",null,null,null,"Tone Control on Tom/Floor",null,null,null,null,"Snare Hoops",null,null,null,null,null,null,null,null,null,null,null,null,null,null,null,null,"",null,null,null,"tt",0,false,0,"8x8",508,null,0,"SY Satin Charcoal",0,0,null,0,null,null,"Tone Control on TOMS","Upcharge",null,null,null,null,null,null,{"$f":"IF(P36=\"\",0,1)","v":0},{"$f":"+BH38*DN35","v":0},"PM0046 Atlas Floor Tom Legs",null,"AX",null,0,0,0,0,0,0,null,null,0,0,null,0,null,{"$f":"+BH25","v":0},"L_RL Vibraband w/ Ludwig Brkt",null,{"$f":"+AL69","v":0},"6Hx14 8 Lug",null,{"$f":"+AR3","v":0},"0G Black Cortex",null,"Size vs. Large Twin",null,null,{"$f":"+AL69","v":0},"6Hx14 8 Lug",null,null,null,null,"Lugs vs Atlas Mount",null,null,"7x8",0,{"$f":"IF(BD16=1,\"LTS878\",\"LT878\")","v":"LT878"},{"$error":"#N/A"},{"$error":"#N/A"},{"$error":"#N/A"},{"$error":"#N/A"},"R"," Cstm  ",{"$error":"#N/A"},{"$f":"ISERROR(DE38)","v":true},"",null,null,null,"DM38",null,"P1216D Classic Ludwig Bracket ",50,null,null,null,null,null,null,null,null,null,null,null,null,null,null,null,{"$f":"+DI69","v":""},null,null,null,null,null,"."]
[null,null,"7x10 Tom Tom",0,null,null,"SL Satin Cherry",null,null,null,null,"N  No tone Control",null,null,null,null,"3F Triple Flanged",null,null,null,null,null,null,null,null,null,null,null,null,null,null,null,"",null,null,null,"tt",{"$f":"IF(B39=\"\",0,1)","v":0},false,{"$f":"IF(AM39=TRUE,B39,AL39)","v":0},"7x10",616,null,0,"SL Satin Cherry",0,0,null,0,null,null,{"$f":"IF(K39=\"\",0,1)","v":0},{"$f":"+AZ39*0","v":0},"N  No tone Control",null,null,null,null,"Selected",{"$f":"SUM(BH35:BH38)","v":0},{"$f":"SUM(BI35:BI38)","v":0},"Upcharge",null,null,null,0,0,0,0,0,0,null,null,0,0,null,0,null,{"$f":"+BH26","v":0},"P7202A Keystone Tom Bracket",null,null,"Anti Brass Lugs",null,0,"BG Black Galaxy",null,{"$f":"+BE4","v":0},"Large Twin (SD)",null,{"$f":"SUM(CM32:CM38)","v":0},"Sum of conflict sizes",null,{"$f":"SUM(AL4:AL60,AL67)","v":0},"Sum of Conflict Sizes",null,null,null,null,"7x10",{"$f":"AL39","v":0},{"$f":"IF(BD16=1,\"LTS870\",\"LT870\")","v":"LT870"},{"$error":"#N/A"},{"$error":"#N/A"},{"$error":"#N/A"},{"$error":"#N/A"},"R"," Cstm  ",{"$error":"#N/A"},true,"",null,null,null,"DM39",null,"L_RL Vibraband w/ Ludwig Brkt",50,null,null,null,null,null,null,null,null,null,null,null,null,null,null,null,"Shell Type","Classic Maple, MPLSDCUSTOM",null,"Total Snare Drums",{"$f":"SUM(D61:D69)","v":0},null,"."]
[null,null,"7.5x10 Tom Tom ",0,null,null,"SM Satin Mahogany",null,null,null,null,"Y  Internal Tone Control",null,null,null,null,"PDC Die Cast Hoops",null,null,null,null,null,null,null,null,null,null,null,null,null,null,null,{"$f":"IF(AN40>0,CONCATENATE(\"qty \",AN40,\") \",AO40,\"   \"),\"\")","v":""},null,null,null,"tt",0,false,0,"7.5x10",616,null,0,"SM Satin Mahogany",0,0,null,0,null,null,{"$f":"IF(K40=\"\",0,1)","v":0},{"$f":"+AZ40*DN45","v":0},"Y  Internal Tone Control",null,null,"Snare Hoops",null,null,null,null,null,null,null,null,0,0,0,0,0,0,null,null,0,0,null,0,null,{"$f":"+BH27","v":0},"L_RK Vibraband w/ Keystone Bracket",null,{"$f":"SUM(BA4:BA7)","v":0},"Mini Classic",null,0,"0Q Black Oyster Pearl",null,null,null,null,null,null,null,null,null,null,{"$f":"+BH28","v":0},"Atlas Tom mount ",null,"7.5x10",0,{"$f":"IF(BD16=1,\"LTS8750\",\"LT8750\")","v":"LT8750"},{"$error":"#N/A"},{"$error":"#N/A"},{"$error":"#N/A"},{"$error":"#N/A"},"R"," Cstm  ",{"$error":"#N/A"},true,"",null,null,null,"DM40",null,"P7202A Keystone Tom Bracket",50,null,null,null,null,null,null,null,null,null,null,null,null,null,null,null,"Drum Type",{"$f":"IF(AZ16 = 1,\"Snare w/Brass\",\"Snare Drum\")","v":"Snare Drum"},null,null,null,null,"."]
[null,null,"8x10 Tom Tom",0,null,null,"SN Satin Natural",null,null,null,null,null,null,null,null,"Size / Hoop Conflict",null,null,null,null,null,null,null,null,null,null,null,null,null,null,null,null,"",null,null,null,"tt",0,{"$f":"ISNUMBER(B40)","v":false},0,"8x10",616,null,0,"SN Satin Natural",0,0,null,null,null,"Selected",{"$f":"SUM(AZ39:AZ40)","v":0},{"$f":"SUM(BA39:BA40)","v":0},"Upcharge",null,null,{"$f":"IF(P39=\"\",0,1)","v":0},{"$f":"+BE41*0","v":0},"3F Triple Flanged",null,null,null,null,null,null,0,0,0,0,0,0,null,null,0,0,null,0,null,null,null,null,{"$f":"SUM(BC4:BC7)","v":0},"Long Lugs",null,0,"0R Black Sparkle",null,{"$f":"+AL61","v":0},"6x12",null,{"$f":"+CM39*CM30","v":0},"Error if > 0",null,{"$f":"+CP39*CP37","v":0},"Error if > 0",null,{"$f":"+BC7","v":0},"Long Lugs on Tom",null,"8x10",0,{"$f":"IF(BD16=1,\"LTS880\",\"LT880\")","v":"LT880"},{"$error":"#N/A"},{"$error":"#N/A"},{"$error":"#N/A"},{"$error":"#N/A"},"R"," Cstm  ",{"$error":"#N/A"},true,"",null,null,null,"DM41",null,"L_RK Vibraband w/ Keystone Bracket",50,null,null,null,null,null,null,null,null,null,null,null,null,null,null,null,"Size",{"$f":"AG79","v":""},null,null,null,null,"."]
[null,null,"9x10 Tom Tom",0,null,null,"Unused",null,null,"Badge",{"$f":"IF((BH24+BH26)*AN73>0, \"Toms will have 2 badges\",\"\")","v":""},null,null,"Throwoff",null,null,null,"Snare Butt",null,null,null,null,null,null,null,null,null,null,null,null,null,null,"",null,null,null,"tt",0,{"$f":"ISNUMBER(B41)","v":false},0,"9x10",616,null,0,"Unused",0,0,null,{"$f":"SUM(AW3:AW40)","v":0},"Selected",null,null,null,null,null,null,{"$f":"IF(P40=\"\",0,1)","v":0},{"$f":"+BE42*DN54","v":0},"PDC Die Cast Hoops",null,null,null,null,null,null,0,0,0,0,0,0,null,null,{"$f":"IF($AZ$16=1,$DN$11,0)","v":0},{"$f":"IF($BH$24+$BH$26>0,$AZ$51*2,$AZ$51)","v":0},null,0,null,{"$f":"IF(SUM(CA37,CA38,CA39,CA40)>0,1,0)","v":0},"Returns a 1 if won't work w/Atlas",null,{"$f":"+BD4","v":0},"Small Twin",null,0,"32 Blue Sparkle",null,{"$f":"+AL62","v":0},"3Hx13",null,null,null,null,null,null,null,{"$f":"+CS41+CS40","v":0},"Error if > 1",null,"9x10",0,{"$f":"IF(BD16=1,\"LTS890\",\"LT890\")","v":"LT890"},{"$error":"#N/A"},{"$error":"#N/A"},{"$error":"#N/A"},{"$error":"#N/A"},{"$f":"IF($BA$7+$CM$8=2,\"WR\",\"R\")","v":"R"}," Cstm  ",{"$error":"#N/A"},true,"",null,null,null,"DM42",null,"PM0046 Atlas Tom Bracket",50,null,null,null,null,null,null,null,null,null,null,null,null,null,null,null,"Finish",{"$f":"+EE32","v":{"$error":"#N/A"}},null,"Throwoff",{"$f":"VLOOKUP(1,BD46:BF50,3,FALSE)","v":{"$error":"#N/A"}},null,"."]
[null,null,"8x12 Tom Tom",0,null,null,"Unused",null,null,null,"LGK Large Gold Keystone",null,null,null,"P85 Supraphonic Strainer",null,null,null,"P33 die cast butt",null,null,null,null,null,null,null,null,null,null,null,null,null,"",null,null,null,"tt",0,{"$f":"ISNUMBER(B42)","v":false},0,"8x12",624,null,0,"Unused",50,0,null,null,null,null,null,null,null,null,"Selected",{"$f":"SUM(BE41:BE42)","v":0},{"$f":"SUM(BF41:BF42)","v":0},"Upcharge",null,null,null,null,null,null,0,0,0,0,0,0,null,null,0,0,null,0,null,null,null,null,{"$f":"+BE4","v":0},"Large Twin",null,0,"0C Champagne Sparkle",null,{"$f":"+AL63","v":0},"6x13",null,{"$f":"+BD50","v":0},"P71 SuperSensitive",null,null,null,null,null,null,null,"8x12",0,{"$f":"IF(BD16=1,\"LTS882\",\"LT882\")","v":"LT882"},{"$error":"#N/A"},{"$error":"#N/A"},{"$error":"#N/A"},{"$error":"#N/A"},"R"," Cstm  ",{"$error":"#N/A"},true,"",null,null,null,null,null,null,null,null,null,null,null,null,null,null,null,null,null,null,null,null,null,null,"Lugs",{"$f":"HLOOKUP(1,BA4:BF8,5,FALSE)","v":{"$error":"#N/A"}},null,"Butt",{"$f":"VLOOKUP(1,BJ47:BL50,3,FALSE)","v":{"$error":"#N/A"}},null,"."]
[null,null,"9x12 Tom Tom",0,null,null,"53 African Bubinga",null,null,null,"BO Blue/Olive",null,null,null,"P86 Millennium Strainer",null,"x",null,"P32 stamped butt",null,null,null,null,null,null,null,null,null,null,null,null,null,"",null,null,null,"tt",0,{"$f":"ISNUMBER(B43)","v":false},0,"9x12",624,null,0,"53 African Bubinga",200,200,null,null,null,null,null,null,null,null,null,null,null,null,null,null,null,null,null,null,{"$f":"AR44*AT44","v":0},{"$f":"AR44*AU44","v":0},0,0,0,0,null,null,0,0,null,0,null,{"$f":"IF(CA42*CA35>0,1,0)","v":0},"Returns a 1 if error",null,{"$f":"SUM(BH11:BH12,BH16)","v":0},"Anti Brass Spurs",null,0,"35 Customer Supply",null,{"$f":"+AL64","v":0},"3Hx14",null,null,null,null,null,null,null,{"$f":"+BH38","v":0},"Atlas Floor Tom Legs",null,"9x12",0,{"$f":"IF(BD16=1,\"LTS892\",\"LT892\")","v":"LT892"},{"$error":"#N/A"},{"$error":"#N/A"},{"$error":"#N/A"},{"$error":"#N/A"},"R"," Cstm  ",{"$error":"#N/A"},true,"",null,null,null,null,null,null,null,null,null,null,null,null,null,null,null,null,null,null,null,null,null,null,"Hardware Finish",{"$f":"IF(AZ16=1,\"Brass Plated\",\"Chrome Plated\")","v":"Chrome Plated"},null,"Hoops",{"$f":"VLOOKUP(1,BE41:BG42,3,FALSE)","v":{"$error":"#N/A"}},null,"."]
[null,null,"10x12 Tom Tom",0,null,null,"50 Birdseye Maple",null,null,null,"GC Cast Brass Badge",null,null,null,"P80 Piccolo Strainer",null,null,null,null,null,null,null,null,null,null,null,null,null,null,null,null,null,"",null,null,null,"tt",0,{"$f":"ISNUMBER(B44)","v":false},0,"10x12",624,null,0,"50 Birdseye Maple",200,200,null,null,null,null,"Badge",null,null,null,"Snare Throwoff",null,null,null,"Codif",null,null,null,null,null,0,0,0,0,0,0,null,null,0,0,null,0,null,null,null,null,{"$f":"+BD11+BD12","v":0},"Claws",null,0,"33 Gold Sparkle",null,{"$f":"+AL65","v":0},"5x14",null,{"$f":"+AL61","v":0},"6x12",null,null,null,null,{"$f":"+BC6","v":0},"Long Lugs on Floor Tom",null,"10x12",0,{"$f":"IF(BD16=1,\"LTS802\",\"LT802\")","v":"LT802"},{"$error":"#N/A"},{"$error":"#N/A"},{"$error":"#N/A"},{"$error":"#N/A"},"R"," Cstm  ",{"$error":"#N/A"},true,"",null,null,null,"DM45",null,"Internal Tone Control (tom, floor, snare)",25,null,null,null,null,null,null,null,null,null,null,null,null,null,null,null,"Tone Control",{"$f":"VLOOKUP(1,BI55:BK56,3,FALSE)","v":{"$error":"#N/A"}},null,"Batter Head",{"$f":"VLOOKUP(1,AZ62:BA63,2,FALSE)","v":{"$error":"#N/A"}},null,"."]
[null,null,"11x12 Tom Tom",0,null,null,"68 Quilted Makore",null,null,null,null,null,null,null,null,null,null,null,null,null,null,null,null,null,null,null,null,null,null,null,null,null,"",null,null,null,"tt",0,false,0,"11x12",624,null,0,"68 Quilted Makore",200,200,null,null,null,{"$f":"IF(J43=\"\",0,1)","v":0},{"$f":"DN57*AY46","v":0},"LGK Large Gold Keystone",null,null,{"$f":"IF(N43=\"\",0,1)","v":0},{"$f":"+BD46*0","v":0},"P85 Supraphonic Strainer",null," ",null,"Snare Butt",null,null,null,0,0,0,0,0,0,null,null,0,0,null,0,null,{"$f":"IF(OR(CA17=1,CA29=1,CA44=1) = TRUE,1,0)","v":0},"Returns a 1 if any error",null,{"$f":"+AZ11","v":0},"Bass Screws",null,0,"54 Green Sparkle",null,{"$f":"+AL68","v":0},"5x14 8 Lug",null,{"$f":"+AL62","v":0},"3Hx13",null,null,null,null,{"$f":"+CS45+CS44","v":0},"Error if > 1",null,"11x12",0,{"$f":"IF(BD16=1,\"LTS812\",\"LT812\")","v":"LT812"},{"$error":"#N/A"},{"$error":"#N/A"},{"$error":"#N/A"},{"$error":"#N/A"},"R"," Cstm  ",{"$error":"#N/A"},true,"",null,null,null,null,null,null,null,null,null,null,null,null,null,null,null,null,null,null,null,null,null,null,null,null,null,"Badge",{"$f":"+EH15","v":{"$error":"#N/A"}},null,"."]
[null,null,"9x13 Tom Tom",0,null,null,"FE Fumed Eucalyptus",null,null,null,null,null,null,null,null,null,"Throwoff / Butt Mis-match",null,null,null,null,null,null,null,null,null,null,null,null,null,null,null,"",null,null,null,"tt",0,false,0,"9x13",692,null,0,"FE Fumed Eucalyptus",200,200,null,null,null,{"$f":"IF(J44=\"\",0,1)","v":0},{"$f":"DN58*AY47","v":0},"BO Blue/Olive",null,null,{"$f":"IF(N44=\"\",0,1)","v":0},{"$f":"+BD47*DN48","v":0},"P86 Millennium Strainer",null,"WM",null,{"$f":"IF(R43=\"\",0,1)","v":0},{"$f":"+BJ47*0","v":0},"P33 die cast butt",null,0,0,0,0,0,0,null,null,0,0,null,0,null,null,null,null,null,"Tom Holder (changed to allow chrome tom holders)",null,0,"JW Jumbo White ",null,{"$f":"SUM(CJ41:CJ46)","v":0},"Sum of Conflict Sizes",null,{"$f":"+AL63","v":0},"6x13",null,null,null,null,null,null,null,"9x13",0,{"$f":"IF(BD16=1,\"LTS893\",\"LT893\")","v":"LT893"},{"$error":"#N/A"},{"$error":"#N/A"},{"$error":"#N/A"},{"$error":"#N/A"},"R"," Cstm  ",{"$error":"#N/A"},true,"",null,null,null,null,null,"Snare Throwoff",null,null,null,null,null,null,null,null,null,null,null,null,null,null,null,null,null,null,null,null,null,null,"."]
[null,null,"10x13 Tom Tom",0,null,null,"Unused",null,null,"Size/Head Conflict",null,null,null,"Size / Throwoff Conflict",null,null,null,"Tone Control on Snare",null,null,null,null,null,null,null,null,null,null,null,null,null,null,"",null,null,null,"tt",0,false,0,"10x13",692,null,0,"Unused",0,0,null,null,null,{"$f":"IF(J45=\"\",0,1)","v":0},0,"GC Cast Brass Badge",null,null,{"$f":"IF(N45=\"\",0,1)","v":0},{"$f":"+BD48*0","v":0},"P80 Piccolo Strainer",null,null,null,{"$f":"IF(R44=\"\",0,1)","v":0},{"$f":"BJ48*DN52","v":0},"P32 stamped butt",null,0,0,0,0,0,0,null,null,0,0,null,0,null,null,null,null,{"$f":"SUM(BH26:BH29)","v":0},"Tom Bracket",null,0,"36 Olive Sparkle",null,{"$f":"+CJ47*CJ39","v":0},"Error if > 0",null,{"$f":"+AL64","v":0},"3Hx14",null,null,null,null,null,null,null,"10x13",0,{"$f":"IF(BD16=1,\"LTS803\",\"LT803\")","v":"LT803"},{"$error":"#N/A"},{"$error":"#N/A"},{"$error":"#N/A"},{"$error":"#N/A"},"R"," Cstm  ",{"$error":"#N/A"},true,"",null,null,null,"DM48",null,"P86 Millennium Strainer",45,null,null,null,null,null,null,null,null,null,null,null,null,null,null,null,null,null,null,null,null,null,"."]
[null,null,"11x13 Tom Tom",0,null,null,"Unused",null,null,null,"Batter Head",null,null,"Size/Head Conflict",null,null,null,null,"N  No Tone Control",null,null,null,null,null,null,null,null,null,null,null,null,null,"",null,null,null,"tt",0,false,0,"11x13",692,null,0,"Unused",0,0,null,null,null,{"$f":"IF(J46=\"\",0,1)","v":0},null,null,null,null,{"$f":"IF(N46=\"\",0,1)","v":0},{"$f":"+BD49*DN49","v":0},"P70 Super Sensitive",null,null,null,{"$f":"IF(R45=\"\",0,1)","v":0},{"$f":"+BJ49*0","v":0},"P70 Super Sensitive",null,0,0,0,0,0,0,null,null,0,0,null,0,null,"Tom Brkt vs Floor Tom Leg",null,null,{"$f":"+AZ40","v":0},"Tone Control (toms)",null,0,"RP Red Oyster",null,null,null,null,{"$f":"+AL65","v":0},"5x14",null,null,null,null,{"$f":"+AZ27","v":0},"Atlas Arch Tom Holder",null,"11x13",0,{"$f":"IF(BD16=1,\"LTS813\",\"LT813\")","v":"LT813"},{"$error":"#N/A"},{"$error":"#N/A"},{"$error":"#N/A"},{"$error":"#N/A"},"R"," Cstm  ",{"$error":"#N/A"},true,"",null,null,null,"DM49",null,"P70 Super Sensitive",270,null,null,null,null,null,null,null,null,null,null,null,null,null,null,null,"Dealer",{"$f":"+K1","v":0},null,null,null,null,"."]
[null,null,"12x13 Tom Tom",0,null,null,"Unused",null,null,"Bass","X","PS3 Clear",null,null,"Reso Head",null,null,null,"Y  Internal Tone Control",null,null,null,null,null,null,null,null,null,null,null,null,null,"",null,null,null,"tt",0,false,0,"12x13",692,null,0,"Unused",0,0,null,null,null,null,null,null,null,null,{"$f":"IF(N47=\"\",0,1)","v":0},{"$f":"+BD50*DN50","v":0},"P71 Super Sensitive",null,null,null,{"$f":"IF(R46=\"\",0,1)","v":0},{"$f":"+BJ50*0","v":0},"P71 Super Sensitive",null,0,0,0,0,0,0,null,null,0,0,null,0,null,null,null,null,{"$f":"SUM(AV62:AV63)","v":0},"Shell Mount",null,0,"27 Red Sparkle",null,null,null,null,{"$f":"+AL67","v":0},"8x14",null,null,null,null,{"$f":"+BC5","v":0},"Long Lugs on Bass Drum",null,"12x13",0,{"$f":"IF(BD16=1,\"LTS823\",\"LT823\")","v":"LT823"},{"$error":"#N/A"},{"$error":"#N/A"},{"$error":"#N/A"},{"$error":"#N/A"},"R"," Cstm  ",{"$error":"#N/A"},true,"",null,null,null,"DM50",null,"P71 Super Sensitive",270,null,null,null,null,null,null,null,null,null,null,null,null,null,null,null,"PO",{"$f":"+P1","v":0},null,null,null,null,"."]
[null,null,"10x14 Tom Tom",0,null,null,"57 Black Cherry",null,null,null,null,null,null,"Bass",null,"PS3 Ebony w/Logo",null,null,null,null,null,null,null,null,null,null,null,null,null,null,null,null,"",null,null,null,"tt",0,false,0,"10x14",788,null,0,"57 Black Cherry",0,200,null,null,null,null,{"$f":"SUM(AZ46:AZ50)","v":0},"Upcharge",null,"Selected",{"$f":"SUM(BD46:BD50)","v":0},{"$f":"SUM(BE46:BE50)","v":0},"Upcharge",null,null,"Selected",{"$f":"SUM(BJ47:BJ50)","v":0},{"$f":"SUM(BK47:BK50)","v":0},"Upcharge",null,0,0,0,0,0,0,null,null,0,0,null,0,null,"Ludwig Tom Brkts and Keystone FT Legs",null,null,{"$f":"+BH36+BH38","v":0},"Floor tom Legs",null,0,"SP ShamPayne",null,"Size vs. Tube Lugs",null,null,{"$f":"+AL68","v":0},"5x14 8 Lug",null,null,null,null,{"$f":"SUM(CS49:CS50)","v":0},"Error if > 1",null,"10x14",0,{"$f":"IF(BD16=1,\"LTS804\",\"LT804\")","v":"LT804"},{"$error":"#N/A"},{"$error":"#N/A"},{"$error":"#N/A"},{"$error":"#N/A"},"R"," Cstm  ",{"$error":"#N/A"},true,"",null,null,null,null,null,null,null,null,null,null,null,null,null,null,null,null,null,null,null,null,null,null,null,null,null,null,null,null,"."]
[null,null,"11x14 Tom Tom",0,null,null,"58 Black Walnut",null,null,"Toms",null,"Clear Emperor",null,null,null,"PS3 Smth White w/Logo",null,null,null,null,null,null,null,null,null,null,null,null,null,null,null,null,"",null,null,null,"tt",0,false,0,"11x14",788,null,0,"58 Black Walnut",0,200,null,null,null,{"$f":"SUM(AY46:AY49)","v":0},"Selected",null,null,null,null,null,null,null,null,null,null,null,null,null,0,0,0,0,0,0,null,null,0,0,null,0,null,{"$f":"+BH23","v":0},"NBKT No Mounting Bracket",null,{"$f":"+BI56","v":0},"Tone Control (snare)",null,0,"1V Silver Glass Glitter",null,{"$f":"+BF4","v":0},"Tube Lugs (SD)",null,{"$f":"SUM(CM45:CM51)","v":0},"Sum of conflict sizes",null,null,null,null,null,null,null,"11x14",0,{"$f":"IF(BD16=1,\"LTS814\",\"LT814\")","v":"LT814"},{"$error":"#N/A"},{"$error":"#N/A"},{"$error":"#N/A"},{"$error":"#N/A"},"R"," Cstm  ",{"$error":"#N/A"},true,"",null,null,null,"DM52",null,"P32 stamped butt",0,null,null,null,null,null,null,null,null,null,null,null,null,null,null,null,null,null,null,null,null,null,"."]
[null,null,"12x14 Tom Tom",0,null,null,"59 S Am Mahogany",null,null,null,null,"Clear Ambassador",null,null,null,"PS3 Clr w/Script Logo",null,null,null,null,null,null,null,null,null,null,null,null,null,null,null,null,"",null,null,null,"tt",0,false,0,"12x14",788,null,0,"59 S Am Mahogany",0,200,null,null,null,null,null,null,null,null,null,null,null,null,null,null,null,null,null,null,0,0,0,0,0,0,null,null,0,0,null,0,null,{"$f":"+BH24","v":0},"P1216D Classic Ludwig Bracket ",null,{"$f":"+BE41","v":0},"3F hoop on snare",null,0,"0S Silver Sparkle",null,null,null,null,null,null,null,null,null,null,null,null,null,"12x14",0,{"$f":"IF(BD16=1,\"LTS824\",\"LT824\")","v":"LT824"},{"$error":"#N/A"},{"$error":"#N/A"},{"$error":"#N/A"},{"$error":"#N/A"},"R"," Cstm  ",{"$error":"#N/A"},true,"",null,null,null,null,null,null,null,null,null,null,null,null,null,null,null,null,null,null,null,null,null,null,null,null,null,null,null,null,"."]
[null,null,"13x14 Tom Tom",0,null,null,"63 Pearwood",null,null,null,null,"Ctd Ambassador",null,null,null,null,null,null,null,null,null,null,null,null,null,null,null,null,null,null,null,null,"",null,null,null,"tt",0,false,0,"13x14",788,null,0,"63 Pearwood",0,200,null,null,null,null,null,null,null,null,null,null,null,null,null,"Tone Control on Snare","Upcharge",null,null,null,0,0,0,0,0,0,null,null,0,0,null,0,null,{"$f":"+BH25","v":0},"L_RL Vibraband w/ Ludwig Brkt",null,{"$f":"SUM(BD46,BD48:BD50)","v":0},"Throwoff",null,0,"52 Sky Blue Pearl",null,{"$f":"+AL67","v":0},"8x14",null,{"$f":"+CM52*CM43","v":0},"Error if > 0",null,null,null,null,null,null,null,"13x14",0,{"$f":"IF(BD16=1,\"LTS834\",\"LT834\")","v":"LT834"},{"$error":"#N/A"},{"$error":"#N/A"},{"$error":"#N/A"},{"$error":"#N/A"},"R"," Cstm  ",{"$error":"#N/A"},true,"",null,null,null,"DM54",null,"PDC Die Cast Hoops on Snare",85,null,null,null,null,null,null,null,null,null,null,null,null,null,null,null,null,null,null,null,null,null,"."]
[null,null,"14x14 Tom Tom",0,null,null,"65 Pomele Sapele",null,null,null,null,null,null,{"$f":"IF(BD16 = 1,\"Floor Toms\",\"Toms\")","v":"Toms"},"X","Clear Ambassador",null,null,null,null,null,null,null,null,null,null,null,null,null,null,null,null,"",null,null,null,"tt",0,false,0,"14x14",788,null,0,"65 Pomele Sapele",0,200,null,null,null,null,"Batter Head",null,null,null,null,"Reso Head",null,null,null,{"$f":"IF(R49=\"\",0,1)","v":0},{"$f":"+BI55*0","v":0},"N  No Tone Control",null,null,0,0,0,0,0,0,null,null,0,0,null,0,null,{"$f":"+BH36","v":0},"LC7202TL Keystone Floor Tom Legs",null,{"$f":"SUM(BJ48:BJ50)","v":0},"Butt",null,0,"37 Teal Blue Sparkle",null,{"$f":"+CJ54*CJ52","v":0},"Error if >0",null,null,null,null,null,null,null,"Size (depth) vs Curved Spurs",null,null,"14x14",0,{"$f":"IF(BD16=1,\"LTS844\",\"LT844\")","v":"LT844"},{"$error":"#N/A"},{"$error":"#N/A"},{"$error":"#N/A"},{"$error":"#N/A"},"R"," Cstm  ",{"$error":"#N/A"},true,"",null,null,null,null,null,null,null,null,null,null,null,null,null,null,null,null,null,null,null,null,null,null,null,null,null,null,null,null,"."]
[null,null,"12x15 Tom Tom",0,null,null,"66 East Indian Rosewood",null,null,"Snare",null,"33 Med Coated ",null,null,null,null,null,null,null,null,null,null,null,null,null,null,null,null,null,null,null,null,"",null,null,null,"tt",0,false,0,"12x15",874,null,0,"66 East Indian Rosewood",0,200,null,null,null,"Bass",{"$f":"IF(K50=\"\",0,1)","v":1},"PS3 Clear",null,null,"Bass",{"$f":"IF(O51=\"\",0,1)","v":0},"PS3 Ebony w/Logo",null,null,{"$f":"IF(R50=\"\",0,1)","v":0},{"$f":"+BI56*DN45","v":0},"Y  Internal Tone Control",null,null,0,0,0,0,0,0,null,null,0,0,null,0,null,{"$f":"SUM(CA53:CA55)","v":0},"Error if >1",null,{"$f":"SUM(CD5:CD55)","v":0},"Total Anti-brass Choices",null,0,"1Q Vintage Black Oyster",null,null,null,null,{"$f":"+BD48","v":0},"P80 Piccolo",null,null,null,null,null,null,null,"12x15",0,{"$f":"IF(BD16=1,\"LTS825\",\"LT825\")","v":"LT825"},{"$error":"#N/A"},{"$error":"#N/A"},{"$error":"#N/A"},{"$error":"#N/A"},"R"," Cstm  ",{"$error":"#N/A"},true,"",null,null,null,null,null,"Badges",null,null,null,null,null,null,null,null,null,null,null,null,null,null,null,null,null,null,null,null,null,null,"."]
[null,null,"13x15 Tom Tom",0,null,null,"Bass Drum Hoop Error",null,null,null,null,"43 Hvy Coated ",null,null,null,null,null,null,null,null,null,null,null,null,null,null,null,null,null,null,null,null,"",null,null,null,"tt",0,false,0,"13x15",874,null,{"$f":"SUM(AR3:AR56)","v":0},"Selected",null,null,null,null,null,null,null,null,null,null,null,0,"PS3 Smth White w/Logo",null,"Selected",{"$f":"SUM(BI55:BI56)","v":0},{"$f":"SUM(BJ55:BJ56)","v":0},"Upcharge",null,null,null,null,0,0,0,0,null,null,0,0,null,0,null,null,null,null,null,null,null,0,"2Q Vintage Blue Oyster",null,null,null,null,null,null,null,null,null,null,{"$f":"AL3","v":0},"12x18",null,"13x15",0,{"$f":"IF(BD16=1,\"LTS835\",\"LT835\")","v":"LT835"},{"$error":"#N/A"},{"$error":"#N/A"},{"$error":"#N/A"},{"$error":"#N/A"},"R"," Cstm  ",{"$error":"#N/A"},true,"",null,null,null,"DM57",null,"Large Gold Keystone",15,null,null,null,null,null,null,null,null,null,null,null,null,null,null,null,null,null,null,null,null,null,"."]
[null,null,"14x15 Tom Tom",0,null,"Bass Drum Hoops",null,null,null,null,null,null,null,null,null,null,null,null,null,null,null,null,null,null,null,null,null,null,null,null,null,null,"",null,null,null,"tt",0,false,0,"14x15",874,null,null,"Bass Drum Hoops",null,null,null,null,null,"Toms",{"$f":"IF(K52=\"\",0,1)","v":0},"Clear Emperor",null,null,null,0,"PS3 Clr w/Script Logo",null,null,null,null,null,null,null,null,null,0,0,0,0,null,null,0,0,null,0,null,"Keystone Tom Brkts and Ludwig FT Legs",null,null,{"$f":"+AZ16","v":0},"BRASS HARDWARE chosen",null,0,"NS Vintage Nickel Sparkle",null,"20\" deep BD vs Long Lugs",null,null,{"$f":"+AL61","v":0},"6x12",null,null,null,null,{"$f":"AL6","v":0},"12x20",null,"14x15",0,{"$f":"IF(BD16=1,\"LTS845\",\"LT845\")","v":"LT845"},{"$error":"#N/A"},{"$error":"#N/A"},{"$error":"#N/A"},{"$error":"#N/A"},"R"," Cstm  ",{"$error":"#N/A"},true,"",null,null,null,"DM58",null,"Blue/Olive",15,null,null,null,null,null,null,null,null,null,null,null,null,null,null,null,null,null,null,null,null,null,"."]
[null,null,"14x16 Tom Tom",0,null,null,"STi Satin Black w/Inlay",null,null,null,null,null,null,null,null,null,null,null,null,null,null,null,null,null,null,null,null,null,null,null,null,null,"",null,null,null,"tt",0,false,0,"14x16",874,null,{"$f":"IF(F59=\"\",0,1)","v":0},"STi Satin Black w/Inlay",{"$f":"AR59*DN62","v":0},null,null,null,null,null,{"$f":"IF(K53=\"\",0,1)","v":0},"Clear Ambassador",null,null,null,null,null,null,null,null,null,null,null,null,null,null,0,0,0,0,null,null,0,0,null,0,null,{"$f":"+BH26","v":0},"P7202A Keystone Tom Bracket",null,null,null,null,0,"NM Vintage White Marine",null,null,"20x20",null,{"$f":"+AL63","v":0},"6x13",null,null,null,null,{"$f":"AL10","v":0},"12x22",null,"14x16",0,{"$f":"IF(BD16=1,\"LTS846\",\"LT846\")","v":"LT846"},{"$error":"#N/A"},{"$error":"#N/A"},{"$error":"#N/A"},{"$error":"#N/A"},"R"," Cstm  ",{"$error":"#N/A"},true,"",null,null,null,"DM59",null,"Gold Cast",0,null,null,null,null,null,null,null,null,null,null,null,null,null,null,null,null,null,null,null,null,null,"."]
[null,null,"16x16 Tom Tom",0,null,null,"SNi Satin Natural w/Inlay",null,null,null," Shell Mount Cymbal Holder",null,null,null,null,null,null,null,null,null,null,null,null,null,null,null,null,null,null,null,null,null,"",null,null,null,"tt",0,false,0,"16x16",874,null,0,"SNi Satin Natural w/Inlay",0,null,"Shell Mount Cymbal Holder",null,null,null,{"$f":"IF(K54=\"\",0,1)","v":0},"Ctd Ambassador",null,null,"Toms",{"$f":"IF(O55=\"\",0,1)","v":1},"Clear Ambassador",null,null,null,null,null,null,null,null,null,0,0,0,0,null,null,0,0,null,0,null,{"$f":"+BH27","v":0},"L_RK Vibraband w/ Keystone Bracket",null,{"$f":"IF(CD56*CD58>0,1,0)","v":0},"returns a 1 if plating error.",null,0,"0F White Cortex",null,{"$f":"+AL14","v":0},"20x22",null,{"$f":"+AL65","v":0},"5x14",null,null,null,null,{"$f":"AL15","v":0},"12x24",null,"16x16",0,{"$f":"IF(BD16=1,\"LTS866\",\"LT866\")","v":"LT866"},{"$error":"#N/A"},{"$error":"#N/A"},{"$error":"#N/A"},{"$error":"#N/A"},"R"," Cstm  ",{"$error":"#N/A"},true,"",null,{"$f":"CONCATENATE(DG35,DG36,DG37,DG38,DG39,DG40,DG41,DG42,DG43,DG44,DG45,DG46,DG47,DG48,DG49,DG50,DG51,DG52,DG53,DG54,DG55,DG56,DG57,DG58,DG59,DG60)","v":""},null,null,null,null,null,null,null,null,null,null,null,null,null,null,null,null,null,null,null,null,null,null,null,null,null,null,"."]
["M P L S D C U S T O M",null,"6x12 Snare",0,null,null,"ST Satin Black",null,null,null,null,"None",null,null,null,null,null,null,null,null,null,null,null,null,null,null,null,null,null,null,null,null,"",null,null,null,"sd",0,false,0,"6x12",690,null,0,"ST Satin Black",0,null,{"$f":"IF(K61=\"\",0,1)","v":0},null,"None",null,null,null,null,null,null,null,null,null,null,null,null,null,null,null,null,null,{"$f":"+$BO$72","v":0},{"$f":"+$BH$4","v":0},{"$f":"+$BE$51","v":0},{"$f":"+$BJ$57","v":0},{"$f":"+$BK$51","v":0},{"$f":"+$BF$43","v":0},{"$f":"IF($AZ$16=1,$DN$12,0)","v":0},{"$f":"$AZ$51","v":0},null,0,null,{"$f":"+BH35","v":0},"LC5023TL Ludwig Floor Tom Legs",null,null,null,null,0,"0P White Marine Pearl",null,{"$f":"+AL19","v":0},"20x24",null,{"$f":"+AL66","v":0},"6Hx14",null,null,null,null,{"$f":"AL20","v":0},"12x26",null,"6x12",0,"LS462",{"$error":"#N/A"},{"$f":"IF($BE$42=1,CONCATENATE(VLOOKUP(1,$CV$73:$CW$76,2,FALSE),\"D\"),CONCATENATE(VLOOKUP(1,$CV$73:$CW$76,2,FALSE),\"X\"))","v":{"$error":"#N/A"}},{"$error":"#N/A"},{"$f":"IF($BD$47=1,\"WM\",\"\")","v":""},{"$f":"IF($AZ$16=1,\"B\",\"\")","v":""}," Cstm  ",{"$f":"CONCATENATE(CY61,CZ61,DA61,DB61,DC61,DD61)","v":{"$error":"#N/A"}},true,{"$f":"IF(DF61=FALSE,DE61,\"\")","v":""},null,null,null,null,null,null,null,null,null,null,null,null,null,null,null,null,null,null,null,null,null,null,null,null,null,null,null,null,"."]
[null,null,"3Hx13 Snare",0,null,null,"SN Satin Natural",null,null,null,null,"Classic P1216 Brkt",null,null,null,null,null,null,null,null,null,null,null,null,null,null,null,null,null,null,null,null,"",null,null,null,"sd",0,false,0,"3.5x13",695,null,0,"SN Satin Natural",0,null,0,null,"Classic P1216 Brkt","Snare",{"$f":"IF(K56=\"\",0,1)","v":0},"33 Med Coated ",null,null,null,null,null,null,null,null,null,null,null,null,null,null,0,{"$f":"+$BH$4","v":0},{"$f":"+$BE$51","v":0},{"$f":"+$BJ$57","v":0},{"$f":"+$BK$51","v":0},{"$f":"+$BF$43","v":0},0,0,null,0,null,{"$f":"SUM(CA59:CA61)","v":0},"Error if >1",null,null,null,null,0,"Unused",null,{"$f":"IF(SUM(CJ59:CJ61)>0,1,0)","v":0},"20\" deep selected",null,{"$f":"+AL67","v":0},"8x14",null,null,null,null,null,null,null,"3Hx13",0,"LS555",{"$error":"#N/A"},{"$error":"#N/A"},{"$error":"#N/A"},"",""," Cstm  ",{"$error":"#N/A"},true,"",null,null,null,null,null,"STi Satin Black w/Inlay",0,null,null,null,null,null,null,null,null,null,null,null,null,null,null,null,null,null,null,null,null,null,"."]
[null,null,"6x13 Snare",0,null,null,"0Ti Sable Black w/Matching Inlay",null,null,null,null,"Keystone P7202 Brkt",null,null,null,null,null,null,null,null,null,null,null,null,null,null,null,null,null,null,null,null,"",null,null,null,"sd",0,false,0,"6x13",706,null,0,"0Ti Sable Black w/Matching Inlay",0,null,0,null,"Keystone P7202 Brkt",null,{"$f":"IF(K57=\"\",0,1)","v":0},"43 Hvy Coated ",null,null,null,null,null,null,null,null,null,null,null,null,null,null,0,{"$f":"+$BH$4","v":0},0,0,0,0,0,0,null,0,null,null,null,null,null,null,null,0,"Unused",null,{"$f":"+BC5","v":0},"long lugs",null,{"$f":"+AL68","v":0},"5x14 8 Lug",null,null,null,null,{"$f":"SUM(CS57:CS62)","v":0},"Conflict Sizes",null,"6x13",0,"LS557",{"$error":"#N/A"},{"$error":"#N/A"},{"$error":"#N/A"},"",""," Cstm  ",{"$error":"#N/A"},true,"",null,null,null,null,null,"SNi Satin Natural w/Inlay",0,null,null,null,null,null,null,null,null,null,null,null,null,null,null,null,null,null,null,null,null,null,"."]
[null,null,"3Hx14 Snare",0,null,null,"0Ni Natural w/Matching Inlay",null,null,null,null,"Left Front",null,null,null,null,null,null,null,null,null,null,null,null,null,null,null,null,null,null,null,null,"",null,null,null,"sd",0,false,0,"3.5x14",706,null,0,"0Ni Natural w/Matching Inlay",0,null,0,{"$f":"+AV64*DN31","v":0},"Left Front",null,null,null,null,null,null,null,null,null,null,null,null,null,null,null,null,null,0,{"$f":"+$BH$4","v":0},0,0,0,0,0,0,null,0,null,{"$f":"IF(OR(CA56>1,CA62>1)=TRUE,1,0)","v":0},"Returns a 1 if any error.",null,null,null,null,0,"Unused",null,null,null,null,{"$f":"+AL69","v":0},"6Hx14 8 Lug",null,null,null,null,{"$f":"BH14","v":0},"2pr Curved spurs",null,"3Hx14",0,"LS558",{"$error":"#N/A"},{"$error":"#N/A"},{"$error":"#N/A"},"",""," Cstm  ",{"$error":"#N/A"},true,"",null,null,null,null,null,"ST Satin Black",0,null,null,null,null,null,null,null,null,null,null,null,null,null,null,null,null,null,null,null,null,null,"."]
[null,null,"5x14 Snare",0,null,null,"0Ta Sable Black w/Accent Inlay",null,null,null,null,"Right Front",null,null,null,null,null,null,null,null,null,null,null,null,null,null,null,null,null,null,null,null,"",null,null,null,"sd",0,false,0,"5x14",725,null,0,"0Ta Sable Black w/Accent Inlay",{"$f":"AR65*DN68","v":0},null,0,{"$f":"+AV65*DN31","v":0},"Right Front",null,null,null,null,null,null,null,null,null,null,null,null,null,null,null,null,null,0,{"$f":"+$BH$4","v":0},0,0,0,0,0,0,null,0,null,null,null,null,null,null,null,0,null,null,{"$f":"+CJ63*CJ62","v":0},"1 if LL and 20\" deep bass ",null,{"$f":"SUM(CM58:CM64)","v":0},"Sum of Conflict Sizes",null,null,null,null,{"$f":"+CS64*CS63","v":0},"Error if >0",null,"5x14",0,"LS401",{"$error":"#N/A"},{"$error":"#N/A"},{"$error":"#N/A"},"",""," Cstm  ",{"$error":"#N/A"},true,"",null,null,null,null,null,"SN Satin Natural",0,null,null,null,null,null,null,null,null,null,null,null,null,null,null,null,null,null,null,null,null,null,"."]
[null,null,"6Hx14 Snare",0,null,null,"0Na Natural w/Accent Inlay",null,null,null,null,"Left Back",null,null,null,null,null,null,null,null,null,null,null,null,null,null,null,null,null,null,null,null,"",null,null,null,"sd",0,false,0,"6.5x14",750,null,0,"0Na Natural w/Accent Inlay",0,null,0,{"$f":"+AV66*DN31","v":0},"Left Back",null,null,null,null,null,null,null,null,null,null,null,null,null,null,null,null,null,0,0,0,0,0,0,0,0,null,0,null,null,null,null,null,null,null,0,null,null,null,null,null,null,null,null,null,null,null,null,null,null,"6Hx14",0,"LS403",{"$error":"#N/A"},{"$error":"#N/A"},{"$error":"#N/A"},"",""," Cstm  ",{"$error":"#N/A"},true,"",null,null,null,null,null,"0Ti Sable Black w/Matching Inlay",200,null,null,null,null,null,null,null,null,null,null,null,null,null,null,null,null,null,null,null,null,null,"."]
[null,null,"8x14 Snare",0,null,null,"FF Full Width Wrap",null,null,null,null,"Right Back",null,null,null,null,null,null,null,null,null,null,null,null,null,null,null,null,null,null,null,null,"",null,null,null,"sd",0,false,0,"8x14",792,null,0,"FF Full Width Wrap",0,null,0,{"$f":"+AV67*DN31","v":0},"Right Back",null,null,null,null,null,null,null,null,null,null,null,null,null,null,null,null,null,0,0,0,0,0,0,0,0,null,0,null,null,null,null,null,null,null,0,null,null,null,null,null,{"$f":"+CM65*CM56","v":0},"Error if > 0",null,null,null,null,null,null,null,"8x14",0,"LS804",{"$error":"#N/A"},{"$error":"#N/A"},{"$error":"#N/A"},"",""," Cstm  ",{"$error":"#N/A"},true,"",null,null,null,null,null,"0Ni Natural w/Matching Inlay",200,null,null,null,null,null,null,null,null,null,null,null,null,null,null,null,null,null,null,null,null,null,"."]
[null,null,"5x14 8 Lug Snare",0,null,null,"FFa Full Width Accent ",null,null,null,null,null,null,null,null,null,null,null,null,null,null,null,null,null,null,null,null,null,null,null,null,null,"",null,null,null,"sd",0,false,0,"5x14 8 Lug",725,null,0,"FFa Full Width Accent ",0,null,null,{"$f":"SUM(AW64:AW67)","v":0},"Upcharge",null,null,null,null,null,null,null,null,null,null,null,null,null,null,null,null,null,0,0,0,0,0,0,0,0,null,{"$f":"SUM(BP68:BX68)","v":0},null,null,null,null,null,null,null,0,null,null,null,null,null,null,null,null,null,null,null,"Size (diameter) vs Elite Spurs",null,null,"5x14 8 Lug",0,"LS401",{"$error":"#N/A"},{"$error":"#N/A"},{"$error":"#N/A"},"",""," Cstm  ",{"$error":"#N/A"},true,"",null,null,null,null,null,"0Ta Sable Black w/Accent Inlay",200,null,null,null,null,null,null,null,null,null,null,null,null,null,null,null,null,null,null,null,null,null,"."]
[null,null,"6Hx14 8 Lug Snare",0,null,null,"MH Matching Hoop",null,null,null,null,null,null,null,null,null,null,null,null,null,null,null,null,null,null,null,null,null,null,null,null,null,"",null,null,null,"sd",0,false,0,"6.5x14 8 Lug",750,null,0,"MH Matching Hoop",0,null,null,null,null,null,null,null,null,null,null,null,null,null,null,null,null,null,null,null,null,null,0,0,0,0,0,0,0,0,null,0,null,null,null,null,null,null,null,0,null,null,null,null,null,{"$f":"IF(SUM(CM67,CM54,CM41,CM28)>0,1,0)","v":0},"returns a 1 if ANY error",null,null,null,null,null,null,null,"6Hx14 8 Lug",0,"LS403",{"$error":"#N/A"},{"$error":"#N/A"},{"$error":"#N/A"},"",""," Cstm  ",{"$error":"#N/A"},true,"",null,{"$f":"CONCATENATE(DG61,DG62,DG63,DG64,DG65,DG66,DG67,DG68,DG69)","v":""},null,null,null,"0Na Natural w/Accent Inlay",200,null,null,null,null,null,null,null,null,null,null,null,null,null,null,null,null,null,null,null,null,null,"."]
[null,null,null,null,null,null,"0T Sable Hoop",null,null,null,null,null,null,null,null,null,null,null,null,null,null,null,null,null,null,null,null,null,null,null,null,null,"",null,null,null,null,null,null,null,null,null,null,0,"0T Sable Hoop",0,null,null,null,null,null,null,null,null,null,null,null,null,null,null,null,null,null,null,null,null,null,null,null,null,null,null,null,null,null,null,null,null,null,null,null,null,null,null,null,null,null,null,null,null,null,null,null,null,null,null,{"$f":"AL23","v":0},"14x28",null,null,null,null,null,null,null,null,null,null,null,null,null,null,null,null,null,null,"FF Full Width Wrap",50,null,null,null,null,null,null,null,null,null,null,null,null,null,null,null,null,null,null,null,null,null,"."]
[null,null,"Order Total",{"$f":"SUM(D3:D70)","v":0},null,null,"0N Natural Hoop",null,null,null,null,null,null,null,null,null,null,null,null,null,null,null,null,null,null,null,null,null,null,null,null,null,null,null,null,null,null,null,"Bass Drum Selected ",{"$f":"SUM(AN3:AN24)","v":0},null,null,null,0,"0N Natural Hoop",0,null,null,null,null,null,null,null,null,null,null,null,null,null,null,null,null,null,null,null,null,null,null,null,null,null,null,null,null,null,null,null,null,null,null,null,null,null,null,{"$f":"SUM(CG38:CG69)","v":0},"Wraps",null,null,null,null,null,null,null,null,null,null,{"$f":"AL24","v":0},"16x28",null,null,null,null,null,null,null,null,null,null,null,null,null,null,null,null,null,null,"FFa Full Width Accent ",50,null,null,null,null,null,null,null,null,null,null,null,null,null,null,null,null,null,null,null,null,null,"."]
[null,null,null,null,null,null,"STa Satin Black w/Accent Inlay",null,null,null,null,null,null,null,null,null,null,null,null,null,null,null,null,null,null,null,null,null,null,null,null,null,null,null,null,null,null,null,"Floor Tom Selected",{"$f":"SUM(AN25:AN34)","v":0},null,null,null,0,"STa Satin Black w/Accent Inlay",0,null,null,null,null,null,null,null,null,null,null,{"$f":"SUM(BE56:BE58)","v":0},"bd Selected",null,null,null,null,null,null,null,{"$f":"SUM(BN3:BN64)","v":0},{"$f":"SUM(BO3:BO64)","v":0},null,"lugs","Throwoff","Tone Cntrl","Butt","DC Hoops","Brass",null,null,null,null,null,null,null,null,null,null,null,null,null,"Claws vs T-Handles",null,null,null,null,null,null,null,null,null,null,null,"SD Lugs",null,"BD Lugs",null,"FT Lugs",null,"TT Lugs",null,null,null,null,null,null,null,null,null,null,"MH Matching Hoop",0,null,null,null,null,null,null,null,null,null,null,null,null,null,null,null,null,null,null,null,null,null,"."]
[null,null,null,null,null,null,"SNa Satin Natural w/Accent Inlay",null,null,null,null,null,null,null,null,null,null,null,null,null,null,null,null,null,null,null,null,null,null,null,null,null,null,null,null,null,null,null,"Tom Tom Selected",{"$f":"SUM(AN35:AN60)","v":0},null,null,null,0,"SNa Satin Natural w/Accent Inlay",0,null,null,null,null,null,null,null,null,null,null,{"$f":"SUM(BE60)","v":1},"tt Selected",null,null,null,null,null,null,null,null,null,null,null,null,null,null,null,null,null,null,null,null,null,null,null,null,null,null,{"$f":"IF(AND(SUM(CG39:CG59,CG61)>0,AR69>0)=TRUE,1,0)","v":0},"Returns a 1 if error",null,{"$f":"BD12","v":0},"Keystone Claws",null,null,null,null,null,null,null,{"$f":"+BH11","v":0},"1 if Elite Spurs",null,{"$f":"BA4","v":0},"M",{"$f":"BA5","v":0},"Mini",{"$f":"BA6","v":0},"Mini",{"$f":"BA7","v":0}," ",null,null,null,null,null,null,null,null,null,"0T Sable Hoop",200,null,null,null,null,null,null,null,null,null,null,null,null,null,null,null,null,null,null,null,null,null,"."]
[null,null,null,null,null,null,null,null,null,null,null,null,null,null,null,null,null,null,null,null,null,null,null,null,null,null,null,null,null,null,null,null,null,null,null,null,null,null,"Snare Drum Selected",{"$f":"SUM(AN61:AN69)","v":0},null,null,null,{"$f":"SUM(AR59:AR73)","v":0},"Selected",null,null,null,null,null,null,{"$f":"SUM(AZ56)","v":1},"bd Selected",null,null,null,null,null,null,null,null,null,null,null,null,null,null,null,null,null,null,null,null,null,null,null,null,null,null,null,null,null,null,null,{"$f":"IF(OR(CG73=1,CG35=1)=TRUE,1,0)","v":0},"Returns a 1 if ANY error",null,{"$f":"AZ11","v":0},"\"T\"-Handles",null,null,null,null,null,null,null,null,null,null,{"$f":"BD4","v":0},"X",{"$f":"BB5","v":0},"WC",{"$f":"BB6","v":0},"WC",{"$f":"BB7","v":0},"WC","C",null,null,null,null,null,null,null,null,"0N Natural Hoop",200,null,null,null,null,null,null,null,null,null,null,null,null,null,null,null,null,null,null,null,null,null,"."]
[null,null,null,null,null,null,{"$f":"IF(SUM(AR7,AR11,AR13,AR14:AR15,AR19,AR20)*SUM(AR60,AR62,AR64,AR71)>0,VLOOKUP(RANDBETWEEN(1,6),AF86:AG91,2,FALSE),\"\")","v":""},null,null,null,null,null,null,null,null,null,null,null,null,null,null,null,null,null,null,null,null,null,null,null,null,null,null,null,null,null,null,null,"Selected",{"$f":"SUM(AN71:AN74)","v":0},null,null,null,null,"Upcharge",{"$f":"SUM(AT59:AT74)","v":0},null,null,null,null,null,{"$f":"SUM(AZ58:AZ60)","v":0},"tt Selected",null,null,null,null,null,null,null,null,null,null,null,null,null,null,null,null,null,null,null,null,null,null,null,null,null,null,null,null,null,null,null,null,null,null,{"$f":"+CJ74*CJ73","v":0},">0 if error.",null,null,null,null,null,null,null,{"$f":"SUM(CS70:CS71)*CS73","v":0},"Error if >0",null,{"$f":"BE4","v":0},"X",{"$f":"BC5","v":0},"WL",{"$f":"BC6","v":0},"WL",{"$f":"BC7","v":0},"WL","L",null,null,null,null,null,null,null,null,"STa Satin Black w/Accent",0,null,null,null,null,null,null,null,null,null,null,null,null,null,null,null,null,null,null,null,null,null,"."]
[null,null,null,null,null,null,{"$f":"IFERROR(IF(MATCH(1,AR3:AR34,0)=MATCH(1,AW3:AW34,0),\"Not an Accent\",\"\"),\"\")","v":""},null,null,null,null,null,null,null,null,null,null,null,null,null,null,null,null,null,null,null,null,null,null,null,null,"Basses",{"$f":"CONCATENATE(AG3,AG4,AG5,AG6,AG7,AG8,AG9,AG10,AG11,AG12,AG13,AG14,AG15,AG16,AG17,AG18,AG19,AG20,AG21,AG22,AG23,AG24)","v":""},null,null,null,null,null,null,null,null,null,null,null,null,null,null,null,null,null,null,{"$f":"SUM(AZ62:AZ63)","v":0},"sd Selected",null,null,null,null,null,null,null,null,null,null,null,null,null,null,null,null,null,null,null,null,null,null,null,null,null,null,null,null,null,null,null,"Dynamic Default for BD Hoops",null,null,null,null,null,null,null,null,null,null,null,null,null,null,{"$f":"BF4","v":0},"T",null,null,null,null,null,null,null,null,null,null,null,null,null,null,null,"SNa Satin Natural w/Accent",0,null,null,null,null,null,null,null,null,null,null,null,null,null,null,null,null,null,null,null,null,null,"."]
[null,null,null,null,null,null,null,null,null,null,null,null,null,null,null,null,null,null,null,null,null,null,null,null,null,null,null,null,null,null,null,"Floors",{"$f":"CONCATENATE(AG25,AG26,AG27,AG28,AG29,AG30,AG31,AG32,AG33,AG34)","v":""},null,null,null,null,null,null,null,null,null,null,null,null,null,null,null,null,null,null,null,null,null,null,null,null,null,null,null,null,null,null,null,null,null,null,null,null,null,null,null,null,null,null,null,null,null,null,null,null,null,null,null,null,"Finishes that get 0Ni hoops",null,null,null,null,null,null,null,null,null,null,null,null,null,null,null,null,null,null,null,null,null,null,null,null,null,null,null,null,null,null,null,null,null,null,null,null,null,null,null,null,null,null,null,null,null,null,null,null,null,null,null,null,null,"."]
[null,null,null,null,null,null,null,null,null,null,null,null,null,null,null,null,null,null,null,null,null,null,null,null,null,null,null,null,null,null,null,"Toms",{"$f":"CONCATENATE(AG35,AG36,AG37,AG38,AG39,AG40,AG41,AG42,AG43,AG44,AG45,AG46,AG47,AG48,AG49,AG50,AG51,AG52,AG53,AG54,AG55,AG56,AG57,AG58,AG59,AG60)","v":""},null,null,null,null,null,null,null,null,null,null,null,null,null,null,null,null,null,null,null,null,null,null,null,null,null,null,null,null,null,null,null,null,null,null,null,null,null,null,null,null,null,null,null,null,null,null,null,null,null,null,null,{"$f":"+AR8","v":0},"0C Champagne Sparkle",null,null,null,null,null,null,null,null,null,null,null,null,null,null,null,null,null,null,null,null,null,null,null,null,null,null,null,null,null,null,null,null,null,null,null,null,null,null,null,null,null,null,null,null,null,null,null,null,null,null,null,null,null,"."]
[null,null,null,null,null,null,null,null,null,null,null,null,null,null,null,null,null,null,null,null,null,null,null,null,null,null,null,null,null,null,null,"Snares",{"$f":"CONCATENATE(AG61,AG62,AG63,AG64,AG65,AG66,AG67,AG68,AG69)","v":""},null,null,null,null,null,null,null,null,null,null,null,null,null,null,null,null,null,null,null,null,null,null,null,null,null,null,null,null,null,null,null,null,null,null,null,null,null,null,null,null,null,null,null,null,null,null,null,null,null,null,null,null,"Not Used",null,null,null,null,null,null,null,null,null,null,null,null,null,null,null,null,null,null,null,null,null,null,null,null,null,null,null,null,null,null,null,null,null,null,null,null,null,null,null,null,null,null,null,null,null,null,null,null,null,null,null,null,null,"."]
[null,null,null,null,null,null,null,null,null,null,null,null,null,null,null,null,null,null,null,null,null,null,null,null,null,null,null,null,null,null,null,null,null,null,null,null,null,null,null,null,null,null,null,null,null,null,null,null,null,null,null,null,null,null,null,null,null,null,null,null,null,null,null,null,null,null,null,null,null,null,null,null,null,null,null,null,null,null,null,null,null,null,null,null,null,null,null,null,null,null,null,null,null,null,null,null,null,null,null,null,null,null,null,null,null,null,null,null,null,null,null,null,null,null,null,null,null,null,null,null,null,null,null,null,null,null,null,null,null,null,null,null,null,null,null,null,null,null,null,"."]
[null,null,"rev 4/25/16",null,null,null,null,null,null,null,null,null,null,null,null,null,null,null,null,null,null,null,null,null,null,null,null,null,null,null,null,null,null,null,null,null,null,null,null,null,null,null,null,null,null,null,null,null,null,null,null,null,null,null,null,null,null,null,null,null,null,null,null,null,null,null,null,null,null,null,null,null,null,null,null,null,null,null,null,null,null,null,null,null,null,null,null,null,null,null,null,null,null,null,null,null,null,null,null,null,null,null,null,null,null,null,null,null,null,null,null,null,null,null,null,null,null,null,null,null,null,null,null,null,null,null,null,null,null,null,null,null,null,null,null,null,null,null,null,"."]
[null,null,null,null,null,null,null,null,null,null,null,null,null,null,null,null,null,null,null,null,null,null,null,null,null,null,null,null,null,null,null,null,null,null,null,null,null,null,null,null,null,null,null,null,null,null,null,null,null,null,null,null,null,null,null,null,null,null,null,null,null,null,null,null,null,null,null,null,null,null,null,null,null,null,null,null,null,null,{"$f":"+CA64+CA46","v":0},null,null,{"$f":"+CD60","v":0},null,null,{"$f":"+CG74+CG89+CG94","v":0},null,null,{"$f":"IF(OR(CJ13>0,CJ21>0,CJ29>0,CJ36>0,CJ48>0,CJ55>0,CJ65>0, CJ75>0),1,0)","v":0},null,null,{"$f":"+CM69+CM16","v":0},null,null,{"$f":"+CP51+CP41+CP27+CP12","v":0},null,null,{"$f":"IF(OR(CS16+CS34>0,CS42>1,CS46>1,CS51>1,CS65>0),1,0)","v":0},null,{"$f":"SUM(CA82:CT82)","v":0},null,null,null,null,null,null,null,null,null,null,null,null,null,null,null,null,null,null,null,null,null,null,null,null,null,null,null,null,null,null,null,null,null,null,null,null,null,null,null,null,"."]
[null,null,null,null,null,null,null,null,null,null,null,null,null,null,null,null,null,null,null,null,null,null,null,null,null,null,null,null,null,null,null,null,null,null,null,null,null,null,null,null,null,null,null,null,null,null,null,null,null,null,null,null,null,null,null,null,null,null,null,null,null,null,null,null,null,null,null,null,null,null,null,null,null,null,null,null,null,null,"any error",null,null,"any error",null,null,"any error",null,null,"any error",null,null,"any error",null,null,"any error",null,null,"any error",null,"Any Error WHATSOEVER!",null,null,null,null,null,null,null,null,null,null,null,null,null,null,null,null,null,null,null,null,null,null,null,null,null,null,null,null,null,null,null,null,null,null,null,null,null,null,null,null,"."]
[null,null,null,null,null,null,null,null,null,null,null,null,null,null,null,null,null,null,null,null,null,null,null,null,null,null,null,null,null,null,null,null,null,null,null,null,null,null,null,null,null,null,null,null,null,null,null,null,null,null,null,null,null,null,null,null,null,null,null,null,null,null,null,null,null,null,null,null,null,null,null,null,null,null,null,null,null,null,null,null,null,null,null,null,null,null,null,null,null,null,null,null,null,null,null,null,null,null,null,null,null,null,null,null,null,null,null,null,null,null,null,null,null,null,null,null,null,null,null,null,null,null,null,null,null,null,null,null,null,null,null,null,null,null,null,null,null,null,null,"."]
[null,null,null,null,null,null,null,null,null,null,null,null,null,null,null,null,null,null,null,null,null,null,null,null,null,null,null,null,null,null,null,null,"Good",null,null,"Bad",null,null,null,null,null,null,null,null,null,null,null,null,null,null,null,null,null,null,null,null,null,null,null,null,null,null,null,null,null,null,null,null,null,null,null,null,null,null,null,null,null,null,null,null,null,null,null,null,null,null,null,null,null,null,null,null,null,null,null,null,null,null,null,null,null,null,null,null,null,null,null,null,null,null,null,null,null,null,null,null,null,null,null,null,null,null,null,null,null,null,null,null,null,null,null,null,null,null,null,null,null,null,null,"."]
[null,null,null,null,null,null,null,null,null,null,null,null,null,null,null,null,null,null,null,null,null,null,null,null,null,null,null,null,null,null,null,1,"Nice!",null,1,"Really?",null,null,null,null,null,null,null,null,null,null,null,null,null,null,null,null,null,null,null,null,null,null,null,null,null,null,null,null,null,null,null,null,null,null,null,null,null,null,null,null,null,null,null,null,null,null,null,null,null,"Spray Finishes vs Single Head",null,null,null,null,null,null,null,null,null,null,null,null,null,null,null,null,null,null,null,null,null,null,null,null,null,null,null,null,null,null,null,null,null,null,null,null,null,null,null,null,null,null,null,null,null,null,null,null,null,null,null,null,null,"."]
[null,null,null,null,null,null,null,null,null,null,null,null,null,null,null,null,null,null,null,null,null,null,null,null,null,null,null,null,null,null,null,2,"Excellent choice!",null,2,"Seriously?",null,null,null,null,null,null,null,null,null,null,null,null,null,null,null,null,null,null,null,null,null,null,null,null,null,null,null,null,null,null,null,null,null,null,null,null,null,null,null,null,null,null,null,null,null,null,null,null,{"$f":"SUM(CG6:CG16)","v":0},"Spray Finishes",null,null,null,null,null,null,null,null,null,null,null,null,null,null,null,null,null,null,null,null,null,null,null,null,null,null,null,null,null,null,null,null,null,null,null,null,null,null,null,null,null,null,null,null,null,null,null,null,null,null,null,null,null,"."]
[null,null,null,null,null,null,null,null,null,null,null,null,null,null,null,null,null,null,null,null,null,null,null,null,null,null,null,null,null,null,null,3,"Ooooooh!",null,3,"You got a second choice?",null,null,null,null,null,null,null,null,null,null,null,null,null,null,null,null,null,null,null,null,null,null,null,null,null,null,null,null,null,null,null,null,null,null,null,null,null,null,null,null,null,null,null,null,null,null,null,null,{"$f":"+BD16","v":0},"Single Head Toms",null,null,null,null,null,null,null,null,null,null,null,null,null,null,null,null,null,null,null,null,null,null,null,null,null,null,null,null,null,null,null,null,null,null,null,null,null,null,null,null,null,null,null,null,null,null,null,null,null,null,null,null,null,"."]
[null,null,null,null,null,null,null,null,null,null,null,null,null,null,null,null,null,null,null,null,null,null,null,null,null,null,null,null,null,null,null,4,"Sweet!",null,4,"I wouldn't.",null,null,null,null,null,null,null,null,null,null,null,null,null,null,null,null,null,null,null,null,null,null,null,null,null,null,null,null,null,null,null,null,null,null,null,null,null,null,null,null,null,null,null,null,null,null,null,null,{"$f":"+CG88*CG87","v":0},"Conflict if >0",null,null,null,null,null,null,null,null,null,null,null,null,null,null,null,null,null,null,null,null,null,null,null,null,null,null,null,null,null,null,null,null,null,null,null,null,null,null,null,null,null,null,null,null,null,null,null,null,null,null,null,null,null,"."]
[null,null,null,null,null,null,null,null,null,null,null,null,null,null,null,null,null,null,null,null,null,null,null,null,null,null,null,null,null,null,null,5,"Very Fine. ",null,5,"Possible, not advisable.",null,null,null,null,null,null,null,null,null,null,null,null,null,null,null,null,null,null,null,null,null,null,null,null,null,null,null,null,null,null,null,null,null,null,null,null,null,null,null,null,null,null,null,null,null,null,null,null,null,null,null,null,null,null,null,null,null,null,null,null,null,null,null,null,null,null,null,null,null,null,null,null,null,null,null,null,null,null,null,null,null,null,null,null,null,null,null,null,null,null,null,null,null,null,null,null,null,null,null,null,null,null,null,"."]
[null,null,null,null,null,null,null,null,null,null,null,null,null,null,null,null,null,null,null,null,null,null,null,null,null,null,null,null,null,null,null,6,"Cool.",null,6,"You're joking, right??",null,null,null,null,null,null,null,null,null,null,null,null,null,null,null,null,null,null,null,null,null,null,null,null,null,null,null,null,null,null,null,null,null,null,null,null,null,null,null,null,null,null,null,null,null,null,null,null,null,null,null,null,null,null,null,null,null,null,null,null,null,null,null,null,null,null,null,null,null,null,null,null,null,null,null,null,null,null,null,null,null,null,null,null,null,null,null,null,null,null,null,null,null,null,null,null,null,null,null,null,null,null,null,"."]
[null,null,null,null,null,null,null,null,null,null,null,null,null,null,null,null,null,null,null,null,null,null,null,null,null,null,null,null,null,null,null,7,null,null,7,"Tacky, dude.",null,null,null,null,null,null,null,null,null,null,null,null,null,null,null,null,null,null,null,null,null,null,null,null,null,null,null,null,null,null,null,null,null,null,null,null,null,null,null,null,null,null,null,null,null,null,null,null,null,"LL Tom Lugs vs Single Head Tom",null,null,null,null,null,null,null,null,null,null,null,null,null,null,null,null,null,null,null,null,null,null,null,null,null,null,null,null,null,null,null,null,null,null,null,null,null,null,null,null,null,null,null,null,null,null,null,null,null,null,null,null,null,"."]
[null,null,null,null,null,null,null,null,null,null,null,null,null,null,null,null,null,null,null,null,null,null,null,null,null,null,null,null,null,null,null,8,null,null,8,"We may have to charge extra.",null,null,null,null,null,null,null,null,null,null,null,null,null,null,null,null,null,null,null,null,null,null,null,null,null,null,null,null,null,null,null,null,null,null,null,null,null,null,null,null,null,null,null,null,null,null,null,null,{"$f":"+BC7","v":0},"LL Tom Lugs",null,null,null,null,null,null,null,null,null,null,null,null,null,null,null,null,null,null,null,null,null,null,null,null,null,null,null,null,null,null,null,null,null,null,null,null,null,null,null,null,null,null,null,null,null,null,null,null,null,null,null,null,null,"."]
[null,null,null,null,null,null,null,null,null,null,null,null,null,null,null,null,null,null,null,null,null,null,null,null,null,null,null,null,null,null,null,9,null,null,9,null,null,null,null,null,null,null,null,null,null,null,null,null,null,null,null,null,null,null,null,null,null,null,null,null,null,null,null,null,null,null,null,null,null,null,null,null,null,null,null,null,null,null,null,null,null,null,null,null,{"$f":"+CG93*CG88","v":0},"Returns a 1 if error.",null,null,null,null,null,null,null,null,null,null,null,null,null,null,null,null,null,null,null,null,null,null,null,null,null,null,null,null,null,null,null,null,null,null,null,null,null,null,null,null,null,null,null,null,null,null,null,null,null,null,null,null,null,"."]
[null,null,null,null,null,null,null,null,null,null,null,null,null,null,null,null,null,null,null,null,null,null,null,null,null,null,null,null,null,null,null,10,null,null,10,null,null,null,null,null,null,null,null,null,null,null,null,null,null,null,null,null,null,null,null,null,null,null,null,null,null,null,null,null,null,null,null,null,null,null,null,null,null,null,null,null,null,null,null,null,null,null,null,null,null,null,null,null,null,null,null,null,null,null,null,null,null,null,null,null,null,null,null,null,null,null,null,null,null,null,null,null,null,null,null,null,null,null,null,null,null,null,null,null,null,null,null,null,null,null,null,null,null,null,null,null,null,null,null,"."]
[null,null,null,null,null,null,null,null,null,null,null,null,null,null,null,null,null,null,null,null,null,null,null,null,null,null,null,null,null,null,null,null,null,null,null,null,null,null,null,null,null,null,null,null,null,null,null,null,null,null,null,null,null,null,null,null,null,null,null,null,null,null,null,null,null,null,null,null,null,null,null,null,null,null,null,null,null,null,null,null,null,null,null,null,null,null,null,null,null,null,null,null,null,null,null,null,null,null,null,null,null,null,null,null,null,null,null,null,null,null,null,null,null,null,null,null,null,null,null,null,null,null,null,null,null,null,null,null,null,null,null,null,null,null,null,null,null,null,null,"."]
[null,null,null,null,null,null,null,null,null,null,null,null,null,null,null,null,null,null,null,null,null,null,null,null,null,null,null,null,null,null,null,null,null,null,null,null,null,null,null,null,null,null,null,null,null,null,null,null,null,null,null,null,null,null,null,null,null,null,null,null,null,null,null,null,null,null,null,null,null,null,null,null,null,null,null,null,null,null,null,null,null,null,null,null,null,null,null,null,null,null,null,null,null,null,null,null,null,null,null,null,null,null,null,null,null,null,null,null,null,null,null,null,null,null,null,null,null,null,null,null,null,null,null,null,null,null,null,null,null,null,null,null,null,null,null,null,null,null,null,"."]
[null,null,null,null,null,null,null,null,null,null,null,null,null,null,null,null,null,null,null,null,null,null,null,null,null,null,null,null,null,null,null,null,null,null,null,null,null,null,null,null,null,null,null,null,null,null,null,null,null,null,null,null,null,null,null,null,null,null,null,null,null,null,null,null,null,null,null,null,null,null,null,null,null,null,null,null,null,null,null,null,null,null,null,null,null,null,null,null,null,null,null,null,null,null,null,null,null,null,null,null,null,null,null,null,null,null,null,null,null,null,null,null,null,null,null,null,null,null,null,null,null,null,null,null,null,null,null,null,null,null,null,null,null,null,null,null,null,null,null,"."]
[null,null,null,null,null,null,null,null,null,null,null,null,null,null,null,null,null,null,null,null,null,null,null,null,null,null,null,null,null,null,null,null,null,null,null,null,null,null,null,null,null,null,null,null,null,null,null,null,null,null,null,null,null,null,null,null,null,null,null,null,null,null,null,null,null,null,null,null,null,null,null,null,null,null,null,null,null,null,null,null,null,null,null,null,null,null,null,null,null,null,null,null,null,null,null,null,null,null,null,null,null,null,null,null,null,null,null,null,null,null,null,null,null,null,null,null,null,null,null,null,null,null,null,null,null,null,null,null,null,null,null,null,null,null,null,null,null,null,null,"."]
[null,null,null,null,null,null,null,null,null,null,null,null,null,null,null,null,null,null,null,null,null,null,null,null,null,null,null,null,null,null,null,null,null,null,null,null,null,null,null,null,null,null,null,null,null,null,null,null,null,null,null,null,null,null,null,null,null,null,null,null,null,null,null,null,null,null,null,null,null,null,null,null,null,null,null,null,null,null,null,null,null,null,null,null,null,null,null,null,null,null,null,null,null,null,null,null,null,null,null,null,null,null,null,null,null,null,null,null,null,null,null,null,null,null,null,null,null,null,null,null,null,null,null,null,null,null,null,null,null,null,null,null,null,null,null,null,null,null,null,"."]
[null,null,null,null,null,null,null,null,null,null,null,null,null,null,null,null,null,null,null,null,null,null,null,null,null,null,null,null,null,null,null,null,null,null,null,null,null,null,null,null,null,null,null,null,null,null,null,null,null,null,null,null,null,null,null,null,null,null,null,null,null,null,null,null,null,null,null,null,null,null,null,null,null,null,null,null,null,null,null,null,null,null,null,null,null,null,null,null,null,null,null,null,null,null,null,null,null,null,null,null,null,null,null,null,null,null,null,null,null,null,null,null,null,null,null,null,null,null,null,null,null,null,null,null,null,null,null,null,null,null,null,null,null,null,null,null,null,null,null,"."]
[null,null,null,null,null,null,null,null,null,null,null,null,null,null,null,null,null,null,null,null,null,null,null,null,null,null,null,null,null,null,null,null,null,null,null,null,null,null,null,null,null,null,null,null,null,null,null,null,null,null,null,null,null,null,null,null,null,null,null,null,null,null,null,null,null,null,null,null,null,null,null,null,null,null,null,null,null,null,null,null,null,null,null,null,null,null,null,null,null,null,null,null,null,null,null,null,null,null,null,null,null,null,null,null,null,null,null,null,null,null,null,null,null,null,null,null,null,null,null,null,null,null,null,null,null,null,null,null,null,null,null,null,null,null,null,null,null,null,null,"."]
[null,null,null,null,null,null,null,null,null,null,null,null,null,null,null,null,null,null,null,null,null,null,null,null,null,null,null,null,null,null,null,null,null,null,null,null,null,null,null,null,null,null,null,null,null,null,null,null,null,null,null,null,null,null,null,null,null,null,null,null,null,null,null,null,null,null,null,null,null,null,null,null,null,null,null,null,null,null,null,null,null,null,null,null,null,null,null,null,null,null,null,null,null,null,null,null,null,null,null,null,null,null,null,null,null,null,null,null,null,null,null,null,null,null,null,null,null,null,null,null,null,null,null,null,null,null,null,null,null,null,null,null,null,null,null,null,null,null,null,"."]
[null,null,null,null,null,null,null,null,null,null,null,null,null,null,null,null,null,null,null,null,null,null,null,null,null,null,null,null,null,null,null,null,null,null,null,null,null,null,null,null,null,null,null,null,null,null,null,null,null,null,null,null,null,null,null,null,null,null,null,null,null,null,null,null,null,null,null,null,null,null,null,null,null,null,null,null,null,null,null,null,null,null,null,null,null,null,null,null,null,null,null,null,null,null,null,null,null,null,null,null,null,null,null,null,null,null,null,null,null,null,null,null,null,null,null,null,null,null,null,null,null,null,null,null,null,null,null,null,null,null,null,null,null,null,null,null,null,null,null,"."]
[null,null,null,null,null,null,null,null,null,null,null,null,null,null,null,null,null,null,null,null,null,null,null,null,null,null,null,null,null,null,null,null,null,null,null,null,null,null,null,null,null,null,null,null,null,null,null,null,null,null,null,null,null,null,null,null,null,null,null,null,null,null,null,null,null,null,null,null,null,null,null,null,null,null,null,null,null,null,null,null,null,null,null,null,null,null,null,null,null,null,null,null,null,null,null,null,null,null,null,null,null,null,null,null,null,null,null,null,null,null,null,null,null,null,null,null,null,null,null,null,null,null,null,null,null,null,null,null,null,null,null,null,null,null,null,null,null,null,null,"."]
[null,null,null,null,null,null,null,null,null,null,null,null,null,null,null,null,null,null,null,null,null,null,null,null,null,null,null,null,null,null,null,null,null,null,null,null,null,null,null,null,null,null,null,null,null,null,null,null,null,null,null,null,null,null,null,null,null,null,null,null,null,null,null,null,null,null,null,null,null,null,null,null,null,null,null,null,null,null,null,null,null,null,null,null,null,null,null,null,null,null,null,null,null,null,null,null,null,null,null,null,null,null,null,null,null,null,null,null,null,null,null,null,null,null,null,null,null,null,null,null,null,null,null,null,null,null,null,null,null,null,null,null,null,null,null,null,null,null,null,"."]
[null,null,null,null,null,null,null,null,null,null,null,null,null,null,null,null,null,null,null,null,null,null,null,null,null,null,null,null,null,null,null,null,null,null,null,null,null,null,null,null,null,null,null,null,null,null,null,null,null,null,null,null,null,null,null,null,null,null,null,null,null,null,null,null,null,null,null,null,null,null,null,null,null,null,null,null,null,null,null,null,null,null,null,null,null,null,null,null,null,null,null,null,null,null,null,null,null,null,null,null,null,null,null,null,null,null,null,null,null,null,null,null,null,null,null,null,null,null,null,null,null,null,null,null,null,null,null,null,null,null,null,null,null,null,null,null,null,null,null,"."]
[null,null,null,null,null,null,null,null,null,null,null,null,null,null,null,null,null,null,null,null,null,null,null,null,null,null,null,null,null,null,null,null,null,null,null,null,null,null,null,null,null,null,null,null,null,null,null,null,null,null,null,null,null,null,null,null,null,null,null,null,null,null,null,null,null,null,null,null,null,null,null,null,null,null,null,null,null,null,null,null,null,null,null,null,null,null,null,null,null,null,null,null,null,null,null,null,null,null,null,null,null,null,null,null,null,null,null,null,null,null,null,null,null,null,null,null,null,null,null,null,null,null,null,null,null,null,null,null,null,null,null,null,null,null,null,null,null,null,null,"."]
[null,null,null,null,null,null,null,null,null,null,null,null,null,null,null,null,null,null,null,null,null,null,null,null,null,null,null,null,null,null,null,null,null,null,null,null,null,null,null,null,null,null,null,null,null,null,null,null,null,null,null,null,null,null,null,null,null,null,null,null,null,null,null,null,null,null,null,null,null,null,null,null,null,null,null,null,null,null,null,null,null,null,null,null,null,null,null,null,null,null,null,null,null,null,null,null,null,null,null,null,null,null,null,null,null,null,null,null,null,null,null,null,null,null,null,null,null,null,null,null,null,null,null,null,null,null,null,null,null,null,null,null,null,null,null,null,null,null,null,"."]
[null,null,null,null,null,null,null,null,null,null,null,null,null,null,null,null,null,null,null,null,null,null,null,null,null,null,null,null,null,null,null,null,null,null,null,null,null,null,null,null,null,null,null,null,null,null,null,null,null,null,null,null,null,null,null,null,null,null,null,null,null,null,null,null,null,null,null,null,null,null,null,null,null,null,null,null,null,null,null,null,null,null,null,null,null,null,null,null,null,null,null,null,null,null,null,null,null,null,null,null,null,null,null,null,null,null,null,null,null,null,null,null,null,null,null,null,null,null,null,null,null,null,null,null,null,null,null,null,null,null,null,null,null,null,null,null,null,null,null,"."]
[null,null,null,null,null,null,null,null,null,null,null,null,null,null,null,null,null,null,null,null,null,null,null,null,null,null,null,null,null,null,null,null,null,null,null,null,null,null,null,null,null,null,null,null,null,null,null,null,null,null,null,null,null,null,null,null,null,null,null,null,null,null,null,null,null,null,null,null,null,null,null,null,null,null,null,null,null,null,null,null,null,null,null,null,null,null,null,null,null,null,null,null,null,null,null,null,null,null,null,null,null,null,null,null,null,null,null,null,null,null,null,null,null,null,null,null,null,null,null,null,null,null,null,null,null,null,null,null,null,null,null,null,null,null,null,null,null,null,null,"."]
[null,null,null,null,null,null,null,null,null,null,null,null,null,null,null,null,null,null,null,null,null,null,null,null,null,null,null,null,null,null,null,null,null,null,null,null,null,null,null,null,null,null,null,null,null,null,null,null,null,null,null,null,null,null,null,null,null,null,null,null,null,null,null,null,null,null,null,null,null,null,null,null,null,null,null,null,null,null,null,null,null,null,null,null,null,null,null,null,null,null,null,null,null,null,null,null,null,null,null,null,null,null,null,null,null,null,null,null,null,null,null,null,null,null,null,null,null,null,null,null,null,null,null,null,null,null,null,null,null,null,null,null,null,null,null,null,null,null,null,"."]
[null,null,null,null,null,null,null,null,null,null,null,null,null,null,null,null,null,null,null,null,null,null,null,null,null,null,null,null,null,null,null,null,null,null,null,null,null,null,null,null,null,null,null,null,null,null,null,null,null,null,null,null,null,null,null,null,null,null,null,null,null,null,null,null,null,null,null,null,null,null,null,null,null,null,null,null,null,null,null,null,null,null,null,null,null,null,null,null,null,null,null,null,null,null,null,null,null,null,null,null,null,null,null,null,null,null,null,null,null,null,null,null,null,null,null,null,null,null,null,null,null,null,null,null,null,null,null,null,null,null,null,null,null,null,null,null,null,null,null,"."]
[null,null,null,null,null,null,null,null,null,null,null,null,null,null,null,null,null,null,null,null,null,null,null,null,null,null,null,null,null,null,null,null,null,null,null,null,null,null,null,null,null,null,null,null,null,null,null,null,null,null,null,null,null,null,null,null,null,null,null,null,null,null,null,null,null,null,null,null,null,null,null,null,null,null,null,null,null,null,null,null,null,null,null,null,null,null,null,null,null,null,null,null,null,null,null,null,null,null,null,null,null,null,null,null,null,null,null,null,null,null,null,null,null,null,null,null,null,null,null,null,null,null,null,null,null,null,null,null,null,null,null,null,null,null,null,null,null,null,null,"."]
[null,null,null,null,null,null,null,null,null,null,null,null,null,null,null,null,null,null,null,null,null,null,null,null,null,null,null,null,null,null,null,null,null,null,null,null,null,null,null,null,null,null,null,null,null,null,null,null,null,null,null,null,null,null,null,null,null,null,null,null,null,null,null,null,null,null,null,null,null,null,null,null,null,null,null,null,null,null,null,null,null,null,null,null,null,null,null,null,null,null,null,null,null,null,null,null,null,null,null,null,null,null,null,null,null,null,null,null,null,null,null,null,null,null,null,null,null,null,null,null,null,null,null,null,null,null,null,null,null,null,null,null,null,null,null,null,null,null,null,"."]
[null,null,null,null,null,null,null,null,null,null,null,null,null,null,null,null,null,null,null,null,null,null,null,null,null,null,null,null,null,null,null,null,null,null,null,null,null,null,null,null,null,null,null,null,null,null,null,null,null,null,null,null,null,null,null,null,null,null,null,null,null,null,null,null,null,null,null,null,null,null,null,null,null,null,null,null,null,null,null,null,null,null,null,null,null,null,null,null,null,null,null,null,null,null,null,null,null,null,null,null,null,null,null,null,null,null,null,null,null,null,null,null,null,null,null,null,null,null,null,null,null,null,null,null,null,null,null,null,null,null,null,null,null,null,null,null,null,null,null,"."]
[null,null,null,null,null,null,null,null,null,null,null,null,null,null,null,null,null,null,null,null,null,null,null,null,null,null,null,null,null,null,null,null,null,null,null,null,null,null,null,null,null,null,null,null,null,null,null,null,null,null,null,null,null,null,null,null,null,null,null,null,null,null,null,null,null,null,null,null,null,null,null,null,null,null,null,null,null,null,null,null,null,null,null,null,null,null,null,null,null,null,null,null,null,null,null,null,null,null,null,null,null,null,null,null,null,null,null,null,null,null,null,null,null,null,null,null,null,null,null,null,null,null,null,null,null,null,null,null,null,null,null,null,null,null,null,null,null,null,null,"."]
[null,null,null,null,null,null,null,null,null,null,null,null,null,null,null,null,null,null,null,null,null,null,null,null,null,null,null,null,null,null,null,null,null,null,null,null,null,null,null,null,null,null,null,null,null,null,null,null,null,null,null,null,null,null,null,null,null,null,null,null,null,null,null,null,null,null,null,null,null,null,null,null,null,null,null,null,null,null,null,null,null,null,null,null,null,null,null,null,null,null,null,null,null,null,null,null,null,null,null,null,null,null,null,null,null,null,null,null,null,null,null,null,null,null,null,null,null,null,null,null,null,null,null,null,null,null,null,null,null,null,null,null,null,null,null,null,null,null,null,"."]
[null,null,null,null,null,null,null,null,null,null,null,null,null,null,null,null,null,null,null,null,null,null,null,null,null,null,null,null,null,null,null,null,null,null,null,null,null,null,null,null,null,null,null,null,null,null,null,null,null,null,null,null,null,null,null,null,null,null,null,null,null,null,null,null,null,null,null,null,null,null,null,null,null,null,null,null,null,null,null,null,null,null,null,null,null,null,null,null,null,null,null,null,null,null,null,null,null,null,null,null,null,null,null,null,null,null,null,null,null,null,null,null,null,null,null,null,null,null,null,null,null,null,null,null,null,null,null,null,null,null,null,null,null,null,null,null,null,null,null,"."]
[null,null,null,null,null,null,null,null,null,null,null,null,null,null,null,null,null,null,null,null,null,null,null,null,null,null,null,null,null,null,null,null,null,null,null,null,null,null,null,null,null,null,null,null,null,null,null,null,null,null,null,null,null,null,null,null,null,null,null,null,null,null,null,null,null,null,null,null,null,null,null,null,null,null,null,null,null,null,null,null,null,null,null,null,null,null,null,null,null,null,null,null,null,null,null,null,null,null,null,null,null,null,null,null,null,null,null,null,null,null,null,null,null,null,null,null,null,null,null,null,null,null,null,null,null,null,null,null,null,null,null,null,null,null,null,null,null,null,null,"."]
[null,null,null,null,null,null,null,null,null,null,null,null,null,null,null,null,null,null,null,null,null,null,null,null,null,null,null,null,null,null,null,null,null,null,null,null,null,null,null,null,null,null,null,null,null,null,null,null,null,null,null,null,null,null,null,null,null,null,null,null,null,null,null,null,null,null,null,null,null,null,null,null,null,null,null,null,null,null,null,null,null,null,null,null,null,null,null,null,null,null,null,null,null,null,null,null,null,null,null,null,null,null,null,null,null,null,null,null,null,null,null,null,null,null,null,null,null,null,null,null,null,null,null,null,null,null,null,null,null,null,null,null,null,null,null,null,null,null,null,"."]
[null,null,null,null,null,null,null,null,null,null,null,null,null,null,null,null,null,null,null,null,null,null,null,null,null,null,null,null,null,null,null,null,null,null,null,null,null,null,null,null,null,null,null,null,null,null,null,null,null,null,null,null,null,null,null,null,null,null,null,null,null,null,null,null,null,null,null,null,null,null,null,null,null,null,null,null,null,null,null,null,null,null,null,null,null,null,null,null,null,null,null,null,null,null,null,null,null,null,null,null,null,null,null,null,null,null,null,null,null,null,null,null,null,null,null,null,null,null,null,null,null,null,null,null,null,null,null,null,null,null,null,null,null,null,null,null,null,null,null,"."]
[null,null,null,null,null,null,null,null,null,null,null,null,null,null,null,null,null,null,null,null,null,null,null,null,null,null,null,null,null,null,null,null,null,null,null,null,null,null,null,null,null,null,null,null,null,null,null,null,null,null,null,null,null,null,null,null,null,null,null,null,null,null,null,null,null,null,null,null,null,null,null,null,null,null,null,null,null,null,null,null,null,null,null,null,null,null,null,null,null,null,null,null,null,null,null,null,null,null,null,null,null,null,null,null,null,null,null,null,null,null,null,null,null,null,null,null,null,null,null,null,null,null,null,null,null,null,null,null,null,null,null,null,null,null,null,null,null,null,null,"."]
[null,null,null,null,null,null,null,null,null,null,null,null,null,null,null,null,null,null,null,null,null,null,null,null,null,null,null,null,null,null,null,null,null,null,null,null,null,null,null,null,null,null,null,null,null,null,null,null,null,null,null,null,null,null,null,null,null,null,null,null,null,null,null,null,null,null,null,null,null,null,null,null,null,null,null,null,null,null,null,null,null,null,null,null,null,null,null,null,null,null,null,null,null,null,null,null,null,null,null,null,null,null,null,null,null,null,null,null,null,null,null,null,null,null,null,null,null,null,null,null,null,null,null,null,null,null,null,null,null,null,null,null,null,null,null,null,null,null,null,"."]
[null,null,null,null,null,null,null,null,null,null,null,null,null,null,null,null,null,null,null,null,null,null,null,null,null,null,null,null,null,null,null,null,null,null,null,null,null,null,null,null,null,null,null,null,null,null,null,null,null,null,null,null,null,null,null,null,null,null,null,null,null,null,null,null,null,null,null,null,null,null,null,null,null,null,null,null,null,null,null,null,null,null,null,null,null,null,null,null,null,null,null,null,null,null,null,null,null,null,null,null,null,null,null,null,null,null,null,null,null,null,null,null,null,null,null,null,null,null,null,null,null,null,null,null,null,null,null,null,null,null,null,null,null,null,null,null,null,null,null,"."]
[null,null,null,null,null,null,null,null,null,null,null,null,null,null,null,null,null,null,null,null,null,null,null,null,null,null,null,null,null,null,null,null,null,null,null,null,null,null,null,null,null,null,null,null,null,null,null,null,null,null,null,null,null,null,null,null,null,null,null,null,null,null,null,null,null,null,null,null,null,null,null,null,null,null,null,null,null,null,null,null,null,null,null,null,null,null,null,null,null,null,null,null,null,null,null,null,null,null,null,null,null,null,null,null,null,null,null,null,null,null,null,null,null,null,null,null,null,null,null,null,null,null,null,null,null,null,null,null,null,null,null,null,null,null,null,null,null,null,null,"."]
[null,null,null,null,null,null,null,null,null,null,null,null,null,null,null,null,null,null,null,null,null,null,null,null,null,null,null,null,null,null,null,null,null,null,null,null,null,null,null,null,null,null,null,null,null,null,null,null,null,null,null,null,null,null,null,null,null,null,null,null,null,null,null,null,null,null,null,null,null,null,null,null,null,null,null,null,null,null,null,null,null,null,null,null,null,null,null,null,null,null,null,null,null,null,null,null,null,null,null,null,null,null,null,null,null,null,null,null,null,null,null,null,null,null,null,null,null,null,null,null,null,null,null,null,null,null,null,null,null,null,null,null,null,null,null,null,null,null,null,"."]
[null,null,null,null,null,null,null,null,null,null,null,null,null,null,null,null,null,null,null,null,null,null,null,null,null,null,null,null,null,null,null,null,null,null,null,null,null,null,null,null,null,null,null,null,null,null,null,null,null,null,null,null,null,null,null,null,null,null,null,null,null,null,null,null,null,null,null,null,null,null,null,null,null,null,null,null,null,null,null,null,null,null,null,null,null,null,null,null,null,null,null,null,null,null,null,null,null,null,null,null,null,null,null,null,null,null,null,null,null,null,null,null,null,null,null,null,null,null,null,null,null,null,null,null,null,null,null,null,null,null,null,null,null,null,null,null,null,null,null,"."]
[null,null,null,null,null,null,null,null,null,null,null,null,null,null,null,null,null,null,null,null,null,null,null,null,null,null,null,null,null,null,null,null,null,null,null,null,null,null,null,null,null,null,null,null,null,null,null,null,null,null,null,null,null,null,null,null,null,null,null,null,null,null,null,null,null,null,null,null,null,null,null,null,null,null,null,null,null,null,null,null,null,null,null,null,null,null,null,null,null,null,null,null,null,null,null,null,null,null,null,null,null,null,null,null,null,null,null,null,null,null,null,null,null,null,null,null,null,null,null,null,null,null,null,null,null,null,null,null,null,null,null,null,null,null,null,null,null,null,null,"."]
[null,null,null,null,null,null,null,null,null,null,null,null,null,null,null,null,null,null,null,null,null,null,null,null,null,null,null,null,null,null,null,null,null,null,null,null,null,null,null,null,null,null,null,null,null,null,null,null,null,null,null,null,null,null,null,null,null,null,null,null,null,null,null,null,null,null,null,null,null,null,null,null,null,null,null,null,null,null,null,null,null,null,null,null,null,null,null,null,null,null,null,null,null,null,null,null,null,null,null,null,null,null,null,null,null,null,null,null,null,null,null,null,null,null,null,null,null,null,null,null,null,null,null,null,null,null,null,null,null,null,null,null,null,null,null,null,null,null,null,"."]
[null,null,null,null,null,null,null,null,null,null,null,null,null,null,null,null,null,null,null,null,null,null,null,null,null,null,null,null,null,null,null,null,null,null,null,null,null,null,null,null,null,null,null,null,null,null,null,null,null,null,null,null,null,null,null,null,null,null,null,null,null,null,null,null,null,null,null,null,null,null,null,null,null,null,null,null,null,null,null,null,null,null,null,null,null,null,null,null,null,null,null,null,null,null,null,null,null,null,null,null,null,null,null,null,null,null,null,null,null,null,null,null,null,null,null,null,null,null,null,null,null,null,null,null,null,null,null,null,null,null,null,null,null,null,null,null,null,null,null,"."]
[null,null,null,null,null,null,null,null,null,null,null,null,null,null,null,null,null,null,null,null,null,null,null,null,null,null,null,null,null,null,null,null,null,null,null,null,null,null,null,null,null,null,null,null,null,null,null,null,null,null,null,null,null,null,null,null,null,null,null,null,null,null,null,null,null,null,null,null,null,null,null,null,null,null,null,null,null,null,null,null,null,null,null,null,null,null,null,null,null,null,null,null,null,null,null,null,null,null,null,null,null,null,null,null,null,null,null,null,null,null,null,null,null,null,null,null,null,null,null,null,null,null,null,null,null,null,null,null,null,null,null,null,null,null,null,null,null,null,null,"."]
[null,null,null,null,null,null,null,null,null,null,null,null,null,null,null,null,null,null,null,null,null,null,null,null,null,null,null,null,null,null,null,null,null,null,null,null,null,null,null,null,null,null,null,null,null,null,null,null,null,null,null,null,null,null,null,null,null,null,null,null,null,null,null,null,null,null,null,null,null,null,null,null,null,null,null,null,null,null,null,null,null,null,null,null,null,null,null,null,null,null,null,null,null,null,null,null,null,null,null,null,null,null,null,null,null,null,null,null,null,null,null,null,null,null,null,null,null,null,null,null,null,null,null,null,null,null,null,null,null,null,null,null,null,null,null,null,null,null,null,"."]
[null,null,null,null,null,null,null,null,null,null,null,null,null,null,null,null,null,null,null,null,null,null,null,null,null,null,null,null,null,null,null,null,null,null,null,null,null,null,null,null,null,null,null,null,null,null,null,null,null,null,null,null,null,null,null,null,null,null,null,null,null,null,null,null,null,null,null,null,null,null,null,null,null,null,null,null,null,null,null,null,null,null,null,null,null,null,null,null,null,null,null,null,null,null,null,null,null,null,null,null,null,null,null,null,null,null,null,null,null,null,null,null,null,null,null,null,null,null,null,null,null,null,null,null,null,null,null,null,null,null,null,null,null,null,null,null,null,null,null,"."]
[null,null,null,null,null,null,null,null,null,null,null,null,null,null,null,null,null,null,null,null,null,null,null,null,null,null,null,null,null,null,null,null,null,null,null,null,null,null,null,null,null,null,null,null,null,null,null,null,null,null,null,null,null,null,null,null,null,null,null,null,null,null,null,null,null,null,null,null,null,null,null,null,null,null,null,null,null,null,null,null,null,null,null,null,null,null,null,null,null,null,null,null,null,null,null,null,null,null,null,null,null,null,null,null,null,null,null,null,null,null,null,null,null,null,null,null,null,null,null,null,null,null,null,null,null,null,null,null,null,null,null,null,null,null,null,null,null,null,null,"."]
[null,null,null,null,null,null,null,null,null,null,null,null,null,null,null,null,null,null,null,null,null,null,null,null,null,null,null,null,null,null,null,null,null,null,null,null,null,null,null,null,null,null,null,null,null,null,null,null,null,null,null,null,null,null,null,null,null,null,null,null,null,null,null,null,null,null,null,null,null,null,null,null,null,null,null,null,null,null,null,null,null,null,null,null,null,null,null,null,null,null,null,null,null,null,null,null,null,null,null,null,null,null,null,null,null,null,null,null,null,null,null,null,null,null,null,null,null,null,null,null,null,null,null,null,null,null,null,null,null,null,null,null,null,null,null,null,null,null,null,"."]
[null,null,null,null,null,null,null,null,null,null,null,null,null,null,null,null,null,null,null,null,null,null,null,null,null,null,null,null,null,null,null,null,null,null,null,null,null,null,null,null,null,null,null,null,null,null,null,null,null,null,null,null,null,null,null,null,null,null,null,null,null,null,null,null,null,null,null,null,null,null,null,null,null,null,null,null,null,null,null,null,null,null,null,null,null,null,null,null,null,null,null,null,null,null,null,null,null,null,null,null,null,null,null,null,null,null,null,null,null,null,null,null,null,null,null,null,null,null,null,null,null,null,null,null,null,null,null,null,null,null,null,null,null,null,null,null,null,null,null,"."]
[null,null,null,null,null,null,null,null,null,null,null,null,null,null,null,null,null,null,null,null,null,null,null,null,null,null,null,null,null,null,null,null,null,null,null,null,null,null,null,null,null,null,null,null,null,null,null,null,null,null,null,null,null,null,null,null,null,null,null,null,null,null,null,null,null,null,null,null,null,null,null,null,null,null,null,null,null,null,null,null,null,null,null,null,null,null,null,null,null,null,null,null,null,null,null,null,null,null,null,null,null,null,null,null,null,null,null,null,null,null,null,null,null,null,null,null,null,null,null,null,null,null,null,null,null,null,null,null,null,null,null,null,null,null,null,null,null,null,null,"."]
[null,null,null,null,null,null,null,null,null,null,null,null,null,null,null,null,null,null,null,null,null,null,null,null,null,null,null,null,null,null,null,null,null,null,null,null,null,null,null,null,null,null,null,null,null,null,null,null,null,null,null,null,null,null,null,null,null,null,null,null,null,null,null,null,null,null,null,null,null,null,null,null,null,null,null,null,null,null,null,null,null,null,null,null,null,null,null,null,null,null,null,null,null,null,null,null,null,null,null,null,null,null,null,null,null,null,null,null,null,null,null,null,null,null,null,null,null,null,null,null,null,null,null,null,null,null,null,null,null,null,null,null,null,null,null,null,null,null,null,"."]
[null,null,null,null,null,null,null,null,null,null,null,null,null,null,null,null,null,null,null,null,null,null,null,null,null,null,null,null,null,null,null,null,null,null,null,null,null,null,null,null,null,null,null,null,null,null,null,null,null,null,null,null,null,null,null,null,null,null,null,null,null,null,null,null,null,null,null,null,null,null,null,null,null,null,null,null,null,null,null,null,null,null,null,null,null,null,null,null,null,null,null,null,null,null,null,null,null,null,null,null,null,null,null,null,null,null,null,null,null,null,null,null,null,null,null,null,null,null,null,null,null,null,null,null,null,null,null,null,null,null,null,null,null,null,null,null,null,null,null,"."]
[null,null,null,null,null,null,null,null,null,null,null,null,null,null,null,null,null,null,null,null,null,null,null,null,null,null,null,null,null,null,null,null,null,null,null,null,null,null,null,null,null,null,null,null,null,null,null,null,null,null,null,null,null,null,null,null,null,null,null,null,null,null,null,null,null,null,null,null,null,null,null,null,null,null,null,null,null,null,null,null,null,null,null,null,null,null,null,null,null,null,null,null,null,null,null,null,null,null,null,null,null,null,null,null,null,null,null,null,null,null,null,null,null,null,null,null,null,null,null,null,null,null,null,null,null,null,null,null,null,null,null,null,null,null,null,null,null,null,null,"."]
[null,null,null,null,null,null,null,null,null,null,null,null,null,null,null,null,null,null,null,null,null,null,null,null,null,null,null,null,null,null,null,null,null,null,null,null,null,null,null,null,null,null,null,null,null,null,null,null,null,null,null,null,null,null,null,null,null,null,null,null,null,null,null,null,null,null,null,null,null,null,null,null,null,null,null,null,null,null,null,null,null,null,null,null,null,null,null,null,null,null,null,null,null,null,null,null,null,null,null,null,null,null,null,null,null,null,null,null,null,null,null,null,null,null,null,null,null,null,null,null,null,null,null,null,null,null,null,null,null,null,null,null,null,null,null,null,null,null,null,"."]
[null,null,null,null,null,null,null,null,null,null,null,null,null,null,null,null,null,null,null,null,null,null,null,null,null,null,null,null,null,null,null,null,null,null,null,null,null,null,null,null,null,null,null,null,null,null,null,null,null,null,null,null,null,null,null,null,null,null,null,null,null,null,null,null,null,null,null,null,null,null,null,null,null,null,null,null,null,null,null,null,null,null,null,null,null,null,null,null,null,null,null,null,null,null,null,null,null,null,null,null,null,null,null,null,null,null,null,null,null,null,null,null,null,null,null,null,null,null,null,null,null,null,null,null,null,null,null,null,null,null,null,null,null,null,null,null,null,null,null,"."]
[null,null,null,null,null,null,null,null,null,null,null,null,null,null,null,null,null,null,null,null,null,null,null,null,null,null,null,null,null,null,null,null,null,null,null,null,null,null,null,null,null,null,null,null,null,null,null,null,null,null,null,null,null,null,null,null,null,null,null,null,null,null,null,null,null,null,null,null,null,null,null,null,null,null,null,null,null,null,null,null,null,null,null,null,null,null,null,null,null,null,null,null,null,null,null,null,null,null,null,null,null,null,null,null,null,null,null,null,null,null,null,null,null,null,null,null,null,null,null,null,null,null,null,null,null,null,null,null,null,null,null,null,null,null,null,null,null,null,null,"."]
[null,null,null,null,null,null,null,null,null,null,null,null,null,null,null,null,null,null,null,null,null,null,null,null,null,null,null,null,null,null,null,null,null,null,null,null,null,null,null,null,null,null,null,null,null,null,null,null,null,null,null,null,null,null,null,null,null,null,null,null,null,null,null,null,null,null,null,null,null,null,null,null,null,null,null,null,null,null,null,null,null,null,null,null,null,null,null,null,null,null,null,null,null,null,null,null,null,null,null,null,null,null,null,null,null,null,null,null,null,null,null,null,null,null,null,null,null,null,null,null,null,null,null,null,null,null,null,null,null,null,null,null,null,null,null,null,null,null,null,"."]
[null,null,null,null,null,null,null,null,null,null,null,null,null,null,null,null,null,null,null,null,null,null,null,null,null,null,null,null,null,null,null,null,null,null,null,null,null,null,null,null,null,null,null,null,null,null,null,null,null,null,null,null,null,null,null,null,null,null,null,null,null,null,null,null,null,null,null,null,null,null,null,null,null,null,null,null,null,null,null,null,null,null,null,null,null,null,null,null,null,null,null,null,null,null,null,null,null,null,null,null,null,null,null,null,null,null,null,null,null,null,null,null,null,null,null,null,null,null,null,null,null,null,null,null,null,null,null,null,null,null,null,null,null,null,null,null,null,null,null,"."]
[null,null,null,null,null,null,null,null,null,null,null,null,null,null,null,null,null,null,null,null,null,null,null,null,null,null,null,null,null,null,null,null,null,null,null,null,null,null,null,null,null,null,null,null,null,null,null,null,null,null,null,null,null,null,null,null,null,null,null,null,null,null,null,null,null,null,null,null,null,null,null,null,null,null,null,null,null,null,null,null,null,null,null,null,null,null,null,null,null,null,null,null,null,null,null,null,null,null,null,null,null,null,null,null,null,null,null,null,null,null,null,null,null,null,null,null,null,null,null,null,null,null,null,null,null,null,null,null,null,null,null,null,null,null,null,null,null,null,null,"."]
[null,null,null,null,null,null,null,null,null,null,null,null,null,null,null,null,null,null,null,null,null,null,null,null,null,null,null,null,null,null,null,null,null,null,null,null,null,null,null,null,null,null,null,null,null,null,null,null,null,null,null,null,null,null,null,null,null,null,null,null,null,null,null,null,null,null,null,null,null,null,null,null,null,null,null,null,null,null,null,null,null,null,null,null,null,null,null,null,null,null,null,null,null,null,null,null,null,null,null,null,null,null,null,null,null,null,null,null,null,null,null,null,null,null,null,null,null,null,null,null,null,null,null,null,null,null,null,null,null,null,null,null,null,null,null,null,null,null,null,"."]
[null,null,null,null,null,null,null,null,null,null,null,null,null,null,null,null,null,null,null,null,null,null,null,null,null,null,null,null,null,null,null,null,null,null,null,null,null,null,null,null,null,null,null,null,null,null,null,null,null,null,null,null,null,null,null,null,null,null,null,null,null,null,null,null,null,null,null,null,null,null,null,null,null,null,null,null,null,null,null,null,null,null,null,null,null,null,null,null,null,null,null,null,null,null,null,null,null,null,null,null,null,null,null,null,null,null,null,null,null,null,null,null,null,null,null,null,null,null,null,null,null,null,null,null,null,null,null,null,null,null,null,null,null,null,null,null,null,null,null,"."]
[null,null,null,null,null,null,null,null,null,null,null,null,null,null,null,null,null,null,null,null,null,null,null,null,null,null,null,null,null,null,null,null,null,null,null,null,null,null,null,null,null,null,null,null,null,null,null,null,null,null,null,null,null,null,null,null,null,null,null,null,null,null,null,null,null,null,null,null,null,null,null,null,null,null,null,null,null,null,null,null,null,null,null,null,null,null,null,null,null,null,null,null,null,null,null,null,null,null,null,null,null,null,null,null,null,null,null,null,null,null,null,null,null,null,null,null,null,null,null,null,null,null,null,null,null,null,null,null,null,null,null,null,null,null,null,null,null,null,null,"."]
[null,null,null,null,null,null,null,null,null,null,null,null,null,null,null,null,null,null,null,null,null,null,null,null,null,null,null,null,null,null,null,null,null,null,null,null,null,null,null,null,null,null,null,null,null,null,null,null,null,null,null,null,null,null,null,null,null,null,null,null,null,null,null,null,null,null,null,null,null,null,null,null,null,null,null,null,null,null,null,null,null,null,null,null,null,null,null,null,null,null,null,null,null,null,null,null,null,null,null,null,null,null,null,null,null,null,null,null,null,null,null,null,null,null,null,null,null,null,null,null,null,null,null,null,null,null,null,null,null,null,null,null,null,null,null,null,null,null,null,"."]
[null,null,null,null,null,null,null,null,null,null,null,null,null,null,null,null,null,null,null,null,null,null,null,null,null,null,null,null,null,null,null,null,null,null,null,null,null,null,null,null,null,null,null,null,null,null,null,null,null,null,null,null,null,null,null,null,null,null,null,null,null,null,null,null,null,null,null,null,null,null,null,null,null,null,null,null,null,null,null,null,null,null,null,null,null,null,null,null,null,null,null,null,null,null,null,null,null,null,null,null,null,null,null,null,null,null,null,null,null,null,null,null,null,null,null,null,null,null,null,null,null,null,null,null,null,null,null,null,null,null,null,null,null,null,null,null,null,null,null,"."]
[null,null,null,null,null,null,null,null,null,null,null,null,null,null,null,null,null,null,null,null,null,null,null,null,null,null,null,null,null,null,null,null,null,null,null,null,null,null,null,null,null,null,null,null,null,null,null,null,null,null,null,null,null,null,null,null,null,null,null,null,null,null,null,null,null,null,null,null,null,null,null,null,null,null,null,null,null,null,null,null,null,null,null,null,null,null,null,null,null,null,null,null,null,null,null,null,null,null,null,null,null,null,null,null,null,null,null,null,null,null,null,null,null,null,null,null,null,null,null,null,null,null,null,null,null,null,null,null,null,null,null,null,null,null,null,null,null,null,null,"."]
[null,null,null,null,null,null,null,null,null,null,null,null,null,null,null,null,null,null,null,null,null,null,null,null,null,null,null,null,null,null,null,null,null,null,null,null,null,null,null,null,null,null,null,null,null,null,null,null,null,null,null,null,null,null,null,null,null,null,null,null,null,null,null,null,null,null,null,null,null,null,null,null,null,null,null,null,null,null,null,null,null,null,null,null,null,null,null,null,null,null,null,null,null,null,null,null,null,null,null,null,null,null,null,null,null,null,null,null,null,null,null,null,null,null,null,null,null,null,null,null,null,null,null,null,null,null,null,null,null,null,null,null,null,null,null,null,null,null,null,"."]
[null,null,null,null,null,null,null,null,null,null,null,null,null,null,null,null,null,null,null,null,null,null,null,null,null,null,null,null,null,null,null,null,null,null,null,null,null,null,null,null,null,null,null,null,null,null,null,null,null,null,null,null,null,null,null,null,null,null,null,null,null,null,null,null,null,null,null,null,null,null,null,null,null,null,null,null,null,null,null,null,null,null,null,null,null,null,null,null,null,null,null,null,null,null,null,null,null,null,null,null,null,null,null,null,null,null,null,null,null,null,null,null,null,null,null,null,null,null,null,null,null,null,null,null,null,null,null,null,null,null,null,null,null,null,null,null,null,null,null,"."]
[null,null,null,null,null,null,null,null,null,null,null,null,null,null,null,null,null,null,null,null,null,null,null,null,null,null,null,null,null,null,null,null,null,null,null,null,null,null,null,null,null,null,null,null,null,null,null,null,null,null,null,null,null,null,null,null,null,null,null,null,null,null,null,null,null,null,null,null,null,null,null,null,null,null,null,null,null,null,null,null,null,null,null,null,null,null,null,null,null,null,null,null,null,null,null,null,null,null,null,null,null,null,null,null,null,null,null,null,null,null,null,null,null,null,null,null,null,null,null,null,null,null,null,null,null,null,null,null,null,null,null,null,null,null,null,null,null,null,null,"."]
[null,null,null,null,null,null,null,null,null,null,null,null,null,null,null,null,null,null,null,null,null,null,null,null,null,null,null,null,null,null,null,null,null,null,null,null,null,null,null,null,null,null,null,null,null,null,null,null,null,null,null,null,null,null,null,null,null,null,null,null,null,null,null,null,null,null,null,null,null,null,null,null,null,null,null,null,null,null,null,null,null,null,null,null,null,null,null,null,null,null,null,null,null,null,null,null,null,null,null,null,null,null,null,null,null,null,null,null,null,null,null,null,null,null,null,null,null,null,null,null,null,null,null,null,null,null,null,null,null,null,null,null,null,null,null,null,null,null,null,"."]
[null,null,null,null,null,null,null,null,null,null,null,null,null,null,null,null,null,null,null,null,null,null,null,null,null,null,null,null,null,null,null,null,null,null,null,null,null,null,null,null,null,null,null,null,null,null,null,null,null,null,null,null,null,null,null,null,null,null,null,null,null,null,null,null,null,null,null,null,null,null,null,null,null,null,null,null,null,null,null,null,null,null,null,null,null,null,null,null,null,null,null,null,null,null,null,null,null,null,null,null,null,null,null,null,null,null,null,null,null,null,null,null,null,null,null,null,null,null,null,null,null,null,null,null,null,null,null,null,null,null,null,null,null,null,null,null,null,null,null,"."]
[null,null,null,null,null,null,null,null,null,null,null,null,null,null,null,null,null,null,null,null,null,null,null,null,null,null,null,null,null,null,null,null,null,null,null,null,null,null,null,null,null,null,null,null,null,null,null,null,null,null,null,null,null,null,null,null,null,null,null,null,null,null,null,null,null,null,null,null,null,null,null,null,null,null,null,null,null,null,null,null,null,null,null,null,null,null,null,null,null,null,null,null,null,null,null,null,null,null,null,null,null,null,null,null,null,null,null,null,null,null,null,null,null,null,null,null,null,null,null,null,null,null,null,null,null,null,null,null,null,null,null,null,null,null,null,null,null,null,null,"."]
[null,null,null,null,null,null,null,null,null,null,null,null,null,null,null,null,null,null,null,null,null,null,null,null,null,null,null,null,null,null,null,null,null,null,null,null,null,null,null,null,null,null,null,null,null,null,null,null,null,null,null,null,null,null,null,null,null,null,null,null,null,null,null,null,null,null,null,null,null,null,null,null,null,null,null,null,null,null,null,null,null,null,null,null,null,null,null,null,null,null,null,null,null,null,null,null,null,null,null,null,null,null,null,null,null,null,null,null,null,null,null,null,null,null,null,null,null,null,null,null,null,null,null,null,null,null,null,null,null,null,null,null,null,null,null,null,null,null,null,"."]
[null,null,null,null,null,null,null,null,null,null,null,null,null,null,null,null,null,null,null,null,null,null,null,null,null,null,null,null,null,null,null,null,null,null,null,null,null,null,null,null,null,null,null,null,null,null,null,null,null,null,null,null,null,null,null,null,null,null,null,null,null,null,null,null,null,null,null,null,null,null,null,null,null,null,null,null,null,null,null,null,null,null,null,null,null,null,null,null,null,null,null,null,null,null,null,null,null,null,null,null,null,null,null,null,null,null,null,null,null,null,null,null,null,null,null,null,null,null,null,null,null,null,null,null,null,null,null,null,null,null,null,null,null,null,null,null,null,null,null,"."]
[null,null,null,null,null,null,null,null,null,null,null,null,null,null,null,null,null,null,null,null,null,null,null,null,null,null,null,null,null,null,null,null,null,null,null,null,null,null,null,null,null,null,null,null,null,null,null,null,null,null,null,null,null,null,null,null,null,null,null,null,null,null,null,null,null,null,null,null,null,null,null,null,null,null,null,null,null,null,null,null,null,null,null,null,null,null,null,null,null,null,null,null,null,null,null,null,null,null,null,null,null,null,null,null,null,null,null,null,null,null,null,null,null,null,null,null,null,null,null,null,null,null,null,null,null,null,null,null,null,null,null,null,null,null,null,null,null,null,null,"."]
[null,null,null,null,null,null,null,null,null,null,null,null,null,null,null,null,null,null,null,null,null,null,null,null,null,null,null,null,null,null,null,null,null,null,null,null,null,null,null,null,null,null,null,null,null,null,null,null,null,null,null,null,null,null,null,null,null,null,null,null,null,null,null,null,null,null,null,null,null,null,null,null,null,null,null,null,null,null,null,null,null,null,null,null,null,null,null,null,null,null,null,null,null,null,null,null,null,null,null,null,null,null,null,null,null,null,null,null,null,null,null,null,null,null,null,null,null,null,null,null,null,null,null,null,null,null,null,null,null,null,null,null,null,null,null,null,null,null,null,"."]
[null,null,null,null,null,null,null,null,null,null,null,null,null,null,null,null,null,null,null,null,null,null,null,null,null,null,null,null,null,null,null,null,null,null,null,null,null,null,null,null,null,null,null,null,null,null,null,null,null,null,null,null,null,null,null,null,null,null,null,null,null,null,null,null,null,null,null,null,null,null,null,null,null,null,null,null,null,null,null,null,null,null,null,null,null,null,null,null,null,null,null,null,null,null,null,null,null,null,null,null,null,null,null,null,null,null,null,null,null,null,null,null,null,null,null,null,null,null,null,null,null,null,null,null,null,null,null,null,null,null,null,null,null,null,null,null,null,null,null,"."]
[null,null,null,null,null,null,null,null,null,null,null,null,null,null,null,null,null,null,null,null,null,null,null,null,null,null,null,null,null,null,null,null,null,null,null,null,null,null,null,null,null,null,null,null,null,null,null,null,null,null,null,null,null,null,null,null,null,null,null,null,null,null,null,null,null,null,null,null,null,null,null,null,null,null,null,null,null,null,null,null,null,null,null,null,null,null,null,null,null,null,null,null,null,null,null,null,null,null,null,null,null,null,null,null,null,null,null,null,null,null,null,null,null,null,null,null,null,null,null,null,null,null,null,null,null,null,null,null,null,null,null,null,null,null,null,null,null,null,null,"."]
[null,null,null,null,null,null,null,null,null,null,null,null,null,null,null,null,null,null,null,null,null,null,null,null,null,null,null,null,null,null,null,null,null,null,null,null,null,null,null,null,null,null,null,null,null,null,null,null,null,null,null,null,null,null,null,null,null,null,null,null,null,null,null,null,null,null,null,null,null,null,null,null,null,null,null,null,null,null,null,null,null,null,null,null,null,null,null,null,null,null,null,null,null,null,null,null,null,null,null,null,null,null,null,null,null,null,null,null,null,null,null,null,null,null,null,null,null,null,null,null,null,null,null,null,null,null,null,null,null,null,null,null,null,null,null,null,null,null,null,"."]
[null,null,null,null,null,null,null,null,null,null,null,null,null,null,null,null,null,null,null,null,null,null,null,null,null,null,null,null,null,null,null,null,null,null,null,null,null,null,null,null,null,null,null,null,null,null,null,null,null,null,null,null,null,null,null,null,null,null,null,null,null,null,null,null,null,null,null,null,null,null,null,null,null,null,null,null,null,null,null,null,null,null,null,null,null,null,null,null,null,null,null,null,null,null,null,null,null,null,null,null,null,null,null,null,null,null,null,null,null,null,null,null,null,null,null,null,null,null,null,null,null,null,null,null,null,null,null,null,null,null,null,null,null,null,null,null,null,null,null,"."]
[null,null,null,null,null,null,null,null,null,null,null,null,null,null,null,null,null,null,null,null,null,null,null,null,null,null,null,null,null,null,null,null,null,null,null,null,null,null,null,null,null,null,null,null,null,null,null,null,null,null,null,null,null,null,null,null,null,null,null,null,null,null,null,null,null,null,null,null,null,null,null,null,null,null,null,null,null,null,null,null,null,null,null,null,null,null,null,null,null,null,null,null,null,null,null,null,null,null,null,null,null,null,null,null,null,null,null,null,null,null,null,null,null,null,null,null,null,null,null,null,null,null,null,null,null,null,null,null,null,null,null,null,null,null,null,null,null,null,null,"."]
[null,null,null,null,null,null,null,null,null,null,null,null,null,null,null,null,null,null,null,null,null,null,null,null,null,null,null,null,null,null,null,null,null,null,null,null,null,null,null,null,null,null,null,null,null,null,null,null,null,null,null,null,null,null,null,null,null,null,null,null,null,null,null,null,null,null,null,null,null,null,null,null,null,null,null,null,null,null,null,null,null,null,null,null,null,null,null,null,null,null,null,null,null,null,null,null,null,null,null,null,null,null,null,null,null,null,null,null,null,null,null,null,null,null,null,null,null,null,null,null,null,null,null,null,null,null,null,null,null,null,null,null,null,null,null,null,null,null,null,"."]
[null,null,null,null,null,null,null,null,null,null,null,null,null,null,null,null,null,null,null,null,null,null,null,null,null,null,null,null,null,null,null,null,null,null,null,null,null,null,null,null,null,null,null,null,null,null,null,null,null,null,null,null,null,null,null,null,null,null,null,null,null,null,null,null,null,null,null,null,null,null,null,null,null,null,null,null,null,null,null,null,null,null,null,null,null,null,null,null,null,null,null,null,null,null,null,null,null,null,null,null,null,null,null,null,null,null,null,null,null,null,null,null,null,null,null,null,null,null,null,null,null,null,null,null,null,null,null,null,null,null,null,null,null,null,null,null,null,null,null,"."]
[null,null,null,null,null,null,null,null,null,null,null,null,null,null,null,null,null,null,null,null,null,null,null,null,null,null,null,null,null,null,null,null,null,null,null,null,null,null,null,null,null,null,null,null,null,null,null,null,null,null,null,null,null,null,null,null,null,null,null,null,null,null,null,null,null,null,null,null,null,null,null,null,null,null,null,null,null,null,null,null,null,null,null,null,null,null,null,null,null,null,null,null,null,null,null,null,null,null,null,null,null,null,null,null,null,null,null,null,null,null,null,null,null,null,null,null,null,null,null,null,null,null,null,null,null,null,null,null,null,null,null,null,null,null,null,null,null,null,null,"."]
[null,null,null,null,null,null,null,null,null,null,null,null,null,null,null,null,null,null,null,null,null,null,null,null,null,null,null,null,null,null,null,null,null,null,null,null,null,null,null,null,null,null,null,null,null,null,null,null,null,null,null,null,null,null,null,null,null,null,null,null,null,null,null,null,null,null,null,null,null,null,null,null,null,null,null,null,null,null,null,null,null,null,null,null,null,null,null,null,null,null,null,null,null,null,null,null,null,null,null,null,null,null,null,null,null,null,null,null,null,null,null,null,null,null,null,null,null,null,null,null,null,null,null,null,null,null,null,null,null,null,null,null,null,null,null,null,null,null,null,"."]
[null,null,null,null,null,null,null,null,null,null,null,null,null,null,null,null,null,null,null,null,null,null,null,null,null,null,null,null,null,null,null,null,null,null,null,null,null,null,null,null,null,null,null,null,null,null,null,null,null,null,null,null,null,null,null,null,null,null,null,null,null,null,null,null,null,null,null,null,null,null,null,null,null,null,null,null,null,null,null,null,null,null,null,null,null,null,null,null,null,null,null,null,null,null,null,null,null,null,null,null,null,null,null,null,null,null,null,null,null,null,null,null,null,null,null,null,null,null,null,null,null,null,null,null,null,null,null,null,null,null,null,null,null,null,null,null,null,null,null,"."]
[null,null,null,null,null,null,null,null,null,null,null,null,null,null,null,null,null,null,null,null,null,null,null,null,null,null,null,null,null,null,null,null,null,null,null,null,null,null,null,null,null,null,null,null,null,null,null,null,null,null,null,null,null,null,null,null,null,null,null,null,null,null,null,null,null,null,null,null,null,null,null,null,null,null,null,null,null,null,null,null,null,null,null,null,null,null,null,null,null,null,null,null,null,null,null,null,null,null,null,null,null,null,null,null,null,null,null,null,null,null,null,null,null,null,null,null,null,null,null,null,null,null,null,null,null,null,null,null,null,null,null,null,null,null,null,null,null,null,null,"."]
[null,null,null,null,null,null,null,null,null,null,null,null,null,null,null,null,null,null,null,null,null,null,null,null,null,null,null,null,null,null,null,null,null,null,null,null,null,null,null,null,null,null,null,null,null,null,null,null,null,null,null,null,null,null,null,null,null,null,null,null,null,null,null,null,null,null,null,null,null,null,null,null,null,null,null,null,null,null,null,null,null,null,null,null,null,null,null,null,null,null,null,null,null,null,null,null,null,null,null,null,null,null,null,null,null,null,null,null,null,null,null,null,null,null,null,null,null,null,null,null,null,null,null,null,null,null,null,null,null,null,null,null,null,null,null,null,null,null,null,"."]
[null,null,null,null,null,null,null,null,null,null,null,null,null,null,null,null,null,null,null,null,null,null,null,null,null,null,null,null,null,null,null,null,null,null,null,null,null,null,null,null,null,null,null,null,null,null,null,null,null,null,null,null,null,null,null,null,null,null,null,null,null,null,null,null,null,null,null,null,null,null,null,null,null,null,null,null,null,null,null,null,null,null,null,null,null,null,null,null,null,null,null,null,null,null,null,null,null,null,null,null,null,null,null,null,null,null,null,null,null,null,null,null,null,null,null,null,null,null,null,null,null,null,null,null,null,null,null,null,null,null,null,null,null,null,null,null,null,null,null,"."]
[null,null,null,null,null,null,null,null,null,null,null,null,null,null,null,null,null,null,null,null,null,null,null,null,null,null,null,null,null,null,null,null,null,null,null,null,null,null,null,null,null,null,null,null,null,null,null,null,null,null,null,null,null,null,null,null,null,null,null,null,null,null,null,null,null,null,null,null,null,null,null,null,null,null,null,null,null,null,null,null,null,null,null,null,null,null,null,null,null,null,null,null,null,null,null,null,null,null,null,null,null,null,null,null,null,null,null,null,null,null,null,null,null,null,null,null,null,null,null,null,null,null,null,null,null,null,null,null,null,null,null,null,null,null,null,null,null,null,null,"."]
[null,null,null,null,null,null,null,null,null,null,null,null,null,null,null,null,null,null,null,null,null,null,null,null,null,null,null,null,null,null,null,null,null,null,null,null,null,null,null,null,null,null,null,null,null,null,null,null,null,null,null,null,null,null,null,null,null,null,null,null,null,null,null,null,null,null,null,null,null,null,null,null,null,null,null,null,null,null,null,null,null,null,null,null,null,null,null,null,null,null,null,null,null,null,null,null,null,null,null,null,null,null,null,null,null,null,null,null,null,null,null,null,null,null,null,null,null,null,null,null,null,null,null,null,null,null,null,null,null,null,null,null,null,null,null,null,null,null,null,"."]
[null,null,null,null,null,null,null,null,null,null,null,null,null,null,null,null,null,null,null,null,null,null,null,null,null,null,null,null,null,null,null,null,null,null,null,null,null,null,null,null,null,null,null,null,null,null,null,null,null,null,null,null,null,null,null,null,null,null,null,null,null,null,null,null,null,null,null,null,null,null,null,null,null,null,null,null,null,null,null,null,null,null,null,null,null,null,null,null,null,null,null,null,null,null,null,null,null,null,null,null,null,null,null,null,null,null,null,null,null,null,null,null,null,null,null,null,null,null,null,null,null,null,null,null,null,null,null,null,null,null,null,null,null,null,null,null,null,null,null,"."]
[null,null,null,null,null,null,null,null,null,null,null,null,null,null,null,null,null,null,null,null,null,null,null,null,null,null,null,null,null,null,null,null,null,null,null,null,null,null,null,null,null,null,null,null,null,null,null,null,null,null,null,null,null,null,null,null,null,null,null,null,null,null,null,null,null,null,null,null,null,null,null,null,null,null,null,null,null,null,null,null,null,null,null,null,null,null,null,null,null,null,null,null,null,null,null,null,null,null,null,null,null,null,null,null,null,null,null,null,null,null,null,null,null,null,null,null,null,null,null,null,null,null,null,null,null,null,null,null,null,null,null,null,null,null,null,null,null,null,null,"."]
[null,null,null,null,null,null,null,null,null,null,null,null,null,null,null,null,null,null,null,null,null,null,null,null,null,null,null,null,null,null,null,null,null,null,null,null,null,null,null,null,null,null,null,null,null,null,null,null,null,null,null,null,null,null,null,null,null,null,null,null,null,null,null,null,null,null,null,null,null,null,null,null,null,null,null,null,null,null,null,null,null,null,null,null,null,null,null,null,null,null,null,null,null,null,null,null,null,null,null,null,null,null,null,null,null,null,null,null,null,null,null,null,null,null,null,null,null,null,null,null,null,null,null,null,null,null,null,null,null,null,null,null,null,null,null,null,null,null,null,"."]
[null,null,null,null,null,null,null,null,null,null,null,null,null,null,null,null,null,null,null,null,null,null,null,null,null,null,null,null,null,null,null,null,null,null,null,null,null,null,null,null,null,null,null,null,null,null,null,null,null,null,null,null,null,null,null,null,null,null,null,null,null,null,null,null,null,null,null,null,null,null,null,null,null,null,null,null,null,null,null,null,null,null,null,null,null,null,null,null,null,null,null,null,null,null,null,null,null,null,null,null,null,null,null,null,null,null,null,null,null,null,null,null,null,null,null,null,null,null,null,null,null,null,null,null,null,null,null,null,null,null,null,null,null,null,null,null,null,null,null,"."]
[null,null,null,null,null,null,null,null,null,null,null,null,null,null,null,null,null,null,null,null,null,null,null,null,null,null,null,null,null,null,null,null,null,null,null,null,null,null,null,null,null,null,null,null,null,null,null,null,null,null,null,null,null,null,null,null,null,null,null,null,null,null,null,null,null,null,null,null,null,null,null,null,null,null,null,null,null,null,null,null,null,null,null,null,null,null,null,null,null,null,null,null,null,null,null,null,null,null,null,null,null,null,null,null,null,null,null,null,null,null,null,null,null,null,null,null,null,null,null,null,null,null,null,null,null,null,null,null,null,null,null,null,null,null,null,null,null,null,null,"."]
[null,null,null,null,null,null,null,null,null,null,null,null,null,null,null,null,null,null,null,null,null,null,null,null,null,null,null,null,null,null,null,null,null,null,null,null,null,null,null,null,null,null,null,null,null,null,null,null,null,null,null,null,null,null,null,null,null,null,null,null,null,null,null,null,null,null,null,null,null,null,null,null,null,null,null,null,null,null,null,null,null,null,null,null,null,null,null,null,null,null,null,null,null,null,null,null,null,null,null,null,null,null,null,null,null,null,null,null,null,null,null,null,null,null,null,null,null,null,null,null,null,null,null,null,null,null,null,null,null,null,null,null,null,null,null,null,null,null,null,"."]
[null,null,null,null,null,null,null,null,null,null,null,null,null,null,null,null,null,null,null,null,null,null,null,null,null,null,null,null,null,null,null,null,null,null,null,null,null,null,null,null,null,null,null,null,null,null,null,null,null,null,null,null,null,null,null,null,null,null,null,null,null,null,null,null,null,null,null,null,null,null,null,null,null,null,null,null,null,null,null,null,null,null,null,null,null,null,null,null,null,null,null,null,null,null,null,null,null,null,null,null,null,null,null,null,null,null,null,null,null,null,null,null,null,null,null,null,null,null,null,null,null,null,null,null,null,null,null,null,null,null,null,null,null,null,null,null,null,null,null,"."]
[null,null,null,null,null,null,null,null,null,null,null,null,null,null,null,null,null,null,null,null,null,null,null,null,null,null,null,null,null,null,null,null,null,null,null,null,null,null,null,null,null,null,null,null,null,null,null,null,null,null,null,null,null,null,null,null,null,null,null,null,null,null,null,null,null,null,null,null,null,null,null,null,null,null,null,null,null,null,null,null,null,null,null,null,null,null,null,null,null,null,null,null,null,null,null,null,null,null,null,null,null,null,null,null,null,null,null,null,null,null,null,null,null,null,null,null,null,null,null,null,null,null,null,null,null,null,null,null,null,null,null,null,null,null,null,null,null,null,null,"."]
[null,null,null,null,null,null,null,null,null,null,null,null,null,null,null,null,null,null,null,null,null,null,null,null,null,null,null,null,null,null,null,null,null,null,null,null,null,null,null,null,null,null,null,null,null,null,null,null,null,null,null,null,null,null,null,null,null,null,null,null,null,null,null,null,null,null,null,null,null,null,null,null,null,null,null,null,null,null,null,null,null,null,null,null,null,null,null,null,null,null,null,null,null,null,null,null,null,null,null,null,null,null,null,null,null,null,null,null,null,null,null,null,null,null,null,null,null,null,null,null,null,null,null,null,null,null,null,null,null,null,null,null,null,null,null,null,null,null,null,"."]
[null,null,null,null,null,null,null,null,null,null,null,null,null,null,null,null,null,null,null,null,null,null,null,null,null,null,null,null,null,null,null,null,null,null,null,null,null,null,null,null,null,null,null,null,null,null,null,null,null,null,null,null,null,null,null,null,null,null,null,null,null,null,null,null,null,null,null,null,null,null,null,null,null,null,null,null,null,null,null,null,null,null,null,null,null,null,null,null,null,null,null,null,null,null,null,null,null,null,null,null,null,null,null,null,null,null,null,null,null,null,null,null,null,null,null,null,null,null,null,null,null,null,null,null,null,null,null,null,null,null,null,null,null,null,null,null,null,null,null,"."]
[null,null,null,null,null,null,null,null,null,null,null,null,null,null,null,null,null,null,null,null,null,null,null,null,null,null,null,null,null,null,null,null,null,null,null,null,null,null,null,null,null,null,null,null,null,null,null,null,null,null,null,null,null,null,null,null,null,null,null,null,null,null,null,null,null,null,null,null,null,null,null,null,null,null,null,null,null,null,null,null,null,null,null,null,null,null,null,null,null,null,null,null,null,null,null,null,null,null,null,null,null,null,null,null,null,null,null,null,null,null,null,null,null,null,null,null,null,null,null,null,null,null,null,null,null,null,null,null,null,null,null,null,null,null,null,null,null,null,null,"."]
[null,null,null,null,null,null,null,null,null,null,null,null,null,null,null,null,null,null,null,null,null,null,null,null,null,null,null,null,null,null,null,null,null,null,null,null,null,null,null,null,null,null,null,null,null,null,null,null,null,null,null,null,null,null,null,null,null,null,null,null,null,null,null,null,null,null,null,null,null,null,null,null,null,null,null,null,null,null,null,null,null,null,null,null,null,null,null,null,null,null,null,null,null,null,null,null,null,null,null,null,null,null,null,null,null,null,null,null,null,null,null,null,null,null,null,null,null,null,null,null,null,null,null,null,null,null,null,null,null,null,null,null,null,null,null,null,null,null,null,"."]
[null,null,null,null,null,null,null,null,null,null,null,null,null,null,null,null,null,null,null,null,null,null,null,null,null,null,null,null,null,null,null,null,null,null,null,null,null,null,null,null,null,null,null,null,null,null,null,null,null,null,null,null,null,null,null,null,null,null,null,null,null,null,null,null,null,null,null,null,null,null,null,null,null,null,null,null,null,null,null,null,null,null,null,null,null,null,null,null,null,null,null,null,null,null,null,null,null,null,null,null,null,null,null,null,null,null,null,null,null,null,null,null,null,null,null,null,null,null,null,null,null,null,null,null,null,null,null,null,null,null,null,null,null,null,null,null,null,null,null,"."]
[null,null,null,null,null,null,null,null,null,null,null,null,null,null,null,null,null,null,null,null,null,null,null,null,null,null,null,null,null,null,null,null,null,null,null,null,null,null,null,null,null,null,null,null,null,null,null,null,null,null,null,null,null,null,null,null,null,null,null,null,null,null,null,null,null,null,null,null,null,null,null,null,null,null,null,null,null,null,null,null,null,null,null,null,null,null,null,null,null,null,null,null,null,null,null,null,null,null,null,null,null,null,null,null,null,null,null,null,null,null,null,null,null,null,null,null,null,null,null,null,null,null,null,null,null,null,null,null,null,null,null,null,null,null,null,null,null,null,null,"."]
[null,null,null,null,null,null,null,null,null,null,null,null,null,null,null,null,null,null,null,null,null,null,null,null,null,null,null,null,null,null,null,null,null,null,null,null,null,null,null,null,null,null,null,null,null,null,null,null,null,null,null,null,null,null,null,null,null,null,null,null,null,null,null,null,null,null,null,null,null,null,null,null,null,null,null,null,null,null,null,null,null,null,null,null,null,null,null,null,null,null,null,null,null,null,null,null,null,null,null,null,null,null,null,null,null,null,null,null,null,null,null,null,null,null,null,null,null,null,null,null,null,null,null,null,null,null,null,null,null,null,null,null,null,null,null,null,null,null,null,"."]
[null,null,null,null,null,null,null,null,null,null,null,null,null,null,null,null,null,null,null,null,null,null,null,null,null,null,null,null,null,null,null,null,null,null,null,null,null,null,null,null,null,null,null,null,null,null,null,null,null,null,null,null,null,null,null,null,null,null,null,null,null,null,null,null,null,null,null,null,null,null,null,null,null,null,null,null,null,null,null,null,null,null,null,null,null,null,null,null,null,null,null,null,null,null,null,null,null,null,null,null,null,null,null,null,null,null,null,null,null,null,null,null,null,null,null,null,null,null,null,null,null,null,null,null,null,null,null,null,null,null,null,null,null,null,null,null,null,null,null,"."]
[null,null,null,null,null,null,null,null,null,null,null,null,null,null,null,null,null,null,null,null,null,null,null,null,null,null,null,null,null,null,null,null,null,null,null,null,null,null,null,null,null,null,null,null,null,null,null,null,null,null,null,null,null,null,null,null,null,null,null,null,null,null,null,null,null,null,null,null,null,null,null,null,null,null,null,null,null,null,null,null,null,null,null,null,null,null,null,null,null,null,null,null,null,null,null,null,null,null,null,null,null,null,null,null,null,null,null,null,null,null,null,null,null,null,null,null,null,null,null,null,null,null,null,null,null,null,null,null,null,null,null,null,null,null,null,null,null,null,null,"."]
[null,null,null,null,null,null,null,null,null,null,null,null,null,null,null,null,null,null,null,null,null,null,null,null,null,null,null,null,null,null,null,null,null,null,null,null,null,null,null,null,null,null,null,null,null,null,null,null,null,null,null,null,null,null,null,null,null,null,null,null,null,null,null,null,null,null,null,null,null,null,null,null,null,null,null,null,null,null,null,null,null,null,null,null,null,null,null,null,null,null,null,null,null,null,null,null,null,null,null,null,null,null,null,null,null,null,null,null,null,null,null,null,null,null,null,null,null,null,null,null,null,null,null,null,null,null,null,null,null,null,null,null,null,null,null,null,null,null,null,"."]
[null,null,null,null,null,null,null,null,null,null,null,null,null,null,null,null,null,null,null,null,null,null,null,null,null,null,null,null,null,null,null,null,null,null,null,null,null,null,null,null,null,null,null,null,null,null,null,null,null,null,null,null,null,null,null,null,null,null,null,null,null,null,null,null,null,null,null,null,null,null,null,null,null,null,null,null,null,null,null,null,null,null,null,null,null,null,null,null,null,null,null,null,null,null,null,null,null,null,null,null,null,null,null,null,null,null,null,null,null,null,null,null,null,null,null,null,null,null,null,null,null,null,null,null,null,null,null,null,null,null,null,null,null,null,null,null,null,null,null,"."]
[null,null,null,null,null,null,null,null,null,null,null,null,null,null,null,null,null,null,null,null,null,null,null,null,null,null,null,null,null,null,null,null,null,null,null,null,null,null,null,null,null,null,null,null,null,null,null,null,null,null,null,null,null,null,null,null,null,null,null,null,null,null,null,null,null,null,null,null,null,null,null,null,null,null,null,null,null,null,null,null,null,null,null,null,null,null,null,null,null,null,null,null,null,null,null,null,null,null,null,null,null,null,null,null,null,null,null,null,null,null,null,null,null,null,null,null,null,null,null,null,null,null,null,null,null,null,null,null,null,null,null,null,null,null,null,null,null,null,null,"."]
[null,null,null,null,null,null,null,null,null,null,null,null,null,null,null,null,null,null,null,null,null,null,null,null,null,null,null,null,null,null,null,null,null,null,null,null,null,null,null,null,null,null,null,null,null,null,null,null,null,null,null,null,null,null,null,null,null,null,null,null,null,null,null,null,null,null,null,null,null,null,null,null,null,null,null,null,null,null,null,null,null,null,null,null,null,null,null,null,null,null,null,null,null,null,null,null,null,null,null,null,null,null,null,null,null,null,null,null,null,null,null,null,null,null,null,null,null,null,null,null,null,null,null,null,null,null,null,null,null,null,null,null,null,null,null,null,null,null,null,"."]
[null,null,null,null,null,null,null,null,null,null,null,null,null,null,null,null,null,null,null,null,null,null,null,null,null,null,null,null,null,null,null,null,null,null,null,null,null,null,null,null,null,null,null,null,null,null,null,null,null,null,null,null,null,null,null,null,null,null,null,null,null,null,null,null,null,null,null,null,null,null,null,null,null,null,null,null,null,null,null,null,null,null,null,null,null,null,null,null,null,null,null,null,null,null,null,null,null,null,null,null,null,null,null,null,null,null,null,null,null,null,null,null,null,null,null,null,null,null,null,null,null,null,null,null,null,null,null,null,null,null,null,null,null,null,null,null,null,null,null,"."]
[null,null,null,null,null,null,null,null,null,null,null,null,null,null,null,null,null,null,null,null,null,null,null,null,null,null,null,null,null,null,null,null,null,null,null,null,null,null,null,null,null,null,null,null,null,null,null,null,null,null,null,null,null,null,null,null,null,null,null,null,null,null,null,null,null,null,null,null,null,null,null,null,null,null,null,null,null,null,null,null,null,null,null,null,null,null,null,null,null,null,null,null,null,null,null,null,null,null,null,null,null,null,null,null,null,null,null,null,null,null,null,null,null,null,null,null,null,null,null,null,null,null,null,null,null,null,null,null,null,null,null,null,null,null,null,null,null,null,null,"."]
[null,null,null,null,null,null,null,null,null,null,null,null,null,null,null,null,null,null,null,null,null,null,null,null,null,null,null,null,null,null,null,null,null,null,null,null,null,null,null,null,null,null,null,null,null,null,null,null,null,null,null,null,null,null,null,null,null,null,null,null,null,null,null,null,null,null,null,null,null,null,null,null,null,null,null,null,null,null,null,null,null,null,null,null,null,null,null,null,null,null,null,null,null,null,null,null,null,null,null,null,null,null,null,null,null,null,null,null,null,null,null,null,null,null,null,null,null,null,null,null,null,null,null,null,null,null,null,null,null,null,null,null,null,null,null,null,null,null,null,"."]
[null,null,null,null,null,null,null,null,null,null,null,null,null,null,null,null,null,null,null,null,null,null,null,null,null,null,null,null,null,null,null,null,null,null,null,null,null,null,null,null,null,null,null,null,null,null,null,null,null,null,null,null,null,null,null,null,null,null,null,null,null,null,null,null,null,null,null,null,null,null,null,null,null,null,null,null,null,null,null,null,null,null,null,null,null,null,null,null,null,null,null,null,null,null,null,null,null,null,null,null,null,null,null,null,null,null,null,null,null,null,null,null,null,null,null,null,null,null,null,null,null,null,null,null,null,null,null,null,null,null,null,null,null,null,null,null,null,null,null,"."]
[null,null,null,null,null,null,null,null,null,null,null,null,null,null,null,null,null,null,null,null,null,null,null,null,null,null,null,null,null,null,null,null,null,null,null,null,null,null,null,null,null,null,null,null,null,null,null,null,null,null,null,null,null,null,null,null,null,null,null,null,null,null,null,null,null,null,null,null,null,null,null,null,null,null,null,null,null,null,null,null,null,null,null,null,null,null,null,null,null,null,null,null,null,null,null,null,null,null,null,null,null,null,null,null,null,null,null,null,null,null,null,null,null,null,null,null,null,null,null,null,null,null,null,null,null,null,null,null,null,null,null,null,null,null,null,null,null,null,null,"."]
[null,null,null,null,null,null,null,null,null,null,null,null,null,null,null,null,null,null,null,null,null,null,null,null,null,null,null,null,null,null,null,null,null,null,null,null,null,null,null,null,null,null,null,null,null,null,null,null,null,null,null,null,null,null,null,null,null,null,null,null,null,null,null,null,null,null,null,null,null,null,null,null,null,null,null,null,null,null,null,null,null,null,null,null,null,null,null,null,null,null,null,null,null,null,null,null,null,null,null,null,null,null,null,null,null,null,null,null,null,null,null,null,null,null,null,null,null,null,null,null,null,null,null,null,null,null,null,null,null,null,null,null,null,null,null,null,null,null,null,"."]
[null,null,null,null,null,null,null,null,null,null,null,null,null,null,null,null,null,null,null,null,null,null,null,null,null,null,null,null,null,null,null,null,null,null,null,null,null,null,null,null,null,null,null,null,null,null,null,null,null,null,null,null,null,null,null,null,null,null,null,null,null,null,null,null,null,null,null,null,null,null,null,null,null,null,null,null,null,null,null,null,null,null,null,null,null,null,null,null,null,null,null,null,null,null,null,null,null,null,null,null,null,null,null,null,null,null,null,null,null,null,null,null,null,null,null,null,null,null,null,null,null,null,null,null,null,null,null,null,null,null,null,null,null,null,null,null,null,null,null,"."]
[null,null,null,null,null,null,null,null,null,null,null,null,null,null,null,null,null,null,null,null,null,null,null,null,null,null,null,null,null,null,null,null,null,null,null,null,null,null,null,null,null,null,null,null,null,null,null,null,null,null,null,null,null,null,null,null,null,null,null,null,null,null,null,null,null,null,null,null,null,null,null,null,null,null,null,null,null,null,null,null,null,null,null,null,null,null,null,null,null,null,null,null,null,null,null,null,null,null,null,null,null,null,null,null,null,null,null,null,null,null,null,null,null,null,null,null,null,null,null,null,null,null,null,null,null,null,null,null,null,null,null,null,null,null,null,null,null,null,null,"."]
[null,null,null,null,null,null,null,null,null,null,null,null,null,null,null,null,null,null,null,null,null,null,null,null,null,null,null,null,null,null,null,null,null,null,null,null,null,null,null,null,null,null,null,null,null,null,null,null,null,null,null,null,null,null,null,null,null,null,null,null,null,null,null,null,null,null,null,null,null,null,null,null,null,null,null,null,null,null,null,null,null,null,null,null,null,null,null,null,null,null,null,null,null,null,null,null,null,null,null,null,null,null,null,null,null,null,null,null,null,null,null,null,null,null,null,null,null,null,null,null,null,null,null,null,null,null,null,null,null,null,null,null,null,null,null,null,null,null,null,"."]
[null,null,null,null,null,null,null,null,null,null,null,null,null,null,null,null,null,null,null,null,null,null,null,null,null,null,null,null,null,null,null,null,null,null,null,null,null,null,null,null,null,null,null,null,null,null,null,null,null,null,null,null,null,null,null,null,null,null,null,null,null,null,null,null,null,null,null,null,null,null,null,null,null,null,null,null,null,null,null,null,null,null,null,null,null,null,null,null,null,null,null,null,null,null,null,null,null,null,null,null,null,null,null,null,null,null,null,null,null,null,null,null,null,null,null,null,null,null,null,null,null,null,null,null,null,null,null,null,null,null,null,null,null,null,null,null,null,null,null,"."]
[null,null,null,null,null,null,null,null,null,null,null,null,null,null,null,null,null,null,null,null,null,null,null,null,null,null,null,null,null,null,null,null,null,null,null,null,null,null,null,null,null,null,null,null,null,null,null,null,null,null,null,null,null,null,null,null,null,null,null,null,null,null,null,null,null,null,null,null,null,null,null,null,null,null,null,null,null,null,null,null,null,null,null,null,null,null,null,null,null,null,null,null,null,null,null,null,null,null,null,null,null,null,null,null,null,null,null,null,null,null,null,null,null,null,null,null,null,null,null,null,null,null,null,null,null,null,null,null,null,null,null,null,null,null,null,null,null,null,null,"."]
[null,null,null,null,null,null,null,null,null,null,null,null,null,null,null,null,null,null,null,null,null,null,null,null,null,null,null,null,null,null,null,null,null,null,null,null,null,null,null,null,null,null,null,null,null,null,null,null,null,null,null,null,null,null,null,null,null,null,null,null,null,null,null,null,null,null,null,null,null,null,null,null,null,null,null,null,null,null,null,null,null,null,null,null,null,null,null,null,null,null,null,null,null,null,null,null,null,null,null,null,null,null,null,null,null,null,null,null,null,null,null,null,null,null,null,null,null,null,null,null,null,null,null,null,null,null,null,null,null,null,null,null,null,null,null,null,null,null,null,"."]
[null,null,null,null,null,null,null,null,null,null,null,null,null,null,null,null,null,null,null,null,null,null,null,null,null,null,null,null,null,null,null,null,null,null,null,null,null,null,null,null,null,null,null,null,null,null,null,null,null,null,null,null,null,null,null,null,null,null,null,null,null,null,null,null,null,null,null,null,null,null,null,null,null,null,null,null,null,null,null,null,null,null,null,null,null,null,null,null,null,null,null,null,null,null,null,null,null,null,null,null,null,null,null,null,null,null,null,null,null,null,null,null,null,null,null,null,null,null,null,null,null,null,null,null,null,null,null,null,null,null,null,null,null,null,null,null,null,null,null,"."]
[null,null,null,null,null,null,null,null,null,null,null,null,null,null,null,null,null,null,null,null,null,null,null,null,null,null,null,null,null,null,null,null,null,null,null,null,null,null,null,null,null,null,null,null,null,null,null,null,null,null,null,null,null,null,null,null,null,null,null,null,null,null,null,null,null,null,null,null,null,null,null,null,null,null,null,null,null,null,null,null,null,null,null,null,null,null,null,null,null,null,null,null,null,null,null,null,null,null,null,null,null,null,null,null,null,null,null,null,null,null,null,null,null,null,null,null,null,null,null,null,null,null,null,null,null,null,null,null,null,null,null,null,null,null,null,null,null,null,null,"."]
[null,null,null,null,null,null,null,null,null,null,null,null,null,null,null,null,null,null,null,null,null,null,null,null,null,null,null,null,null,null,null,null,null,null,null,null,null,null,null,null,null,null,null,null,null,null,null,null,null,null,null,null,null,null,null,null,null,null,null,null,null,null,null,null,null,null,null,null,null,null,null,null,null,null,null,null,null,null,null,null,null,null,null,null,null,null,null,null,null,null,null,null,null,null,null,null,null,null,null,null,null,null,null,null,null,null,null,null,null,null,null,null,null,null,null,null,null,null,null,null,null,null,null,null,null,null,null,null,null,null,null,null,null,null,null,null,null,null,null,"."]
[null,null,null,null,null,null,null,null,null,null,null,null,null,null,null,null,null,null,null,null,null,null,null,null,null,null,null,null,null,null,null,null,null,null,null,null,null,null,null,null,null,null,null,null,null,null,null,null,null,null,null,null,null,null,null,null,null,null,null,null,null,null,null,null,null,null,null,null,null,null,null,null,null,null,null,null,null,null,null,null,null,null,null,null,null,null,null,null,null,null,null,null,null,null,null,null,null,null,null,null,null,null,null,null,null,null,null,null,null,null,null,null,null,null,null,null,null,null,null,null,null,null,null,null,null,null,null,null,null,null,null,null,null,null,null,null,null,null,null,"."]
[null,null,null,null,null,null,null,null,null,null,null,null,null,null,null,null,null,null,null,null,null,null,null,null,null,null,null,null,null,null,null,null,null,null,null,null,null,null,null,null,null,null,null,null,null,null,null,null,null,null,null,null,null,null,null,null,null,null,null,null,null,null,null,null,null,null,null,null,null,null,null,null,null,null,null,null,null,null,null,null,null,null,null,null,null,null,null,null,null,null,null,null,null,null,null,null,null,null,null,null,null,null,null,null,null,null,null,null,null,null,null,null,null,null,null,null,null,null,null,null,null,null,null,null,null,null,null,null,null,null,null,null,null,null,null,null,null,null,null,"."]
[null,null,null,null,null,null,null,null,null,null,null,null,null,null,null,null,null,null,null,null,null,null,null,null,null,null,null,null,null,null,null,null,null,null,null,null,null,null,null,null,null,null,null,null,null,null,null,null,null,null,null,null,null,null,null,null,null,null,null,null,null,null,null,null,null,null,null,null,null,null,null,null,null,null,null,null,null,null,null,null,null,null,null,null,null,null,null,null,null,null,null,null,null,null,null,null,null,null,null,null,null,null,null,null,null,null,null,null,null,null,null,null,null,null,null,null,null,null,null,null,null,null,null,null,null,null,null,null,null,null,null,null,null,null,null,null,null,null,null,"."]
[null,null,null,null,null,null,null,null,null,null,null,null,null,null,null,null,null,null,null,null,null,null,null,null,null,null,null,null,null,null,null,null,null,null,null,null,null,null,null,null,null,null,null,null,null,null,null,null,null,null,null,null,null,null,null,null,null,null,null,null,null,null,null,null,null,null,null,null,null,null,null,null,null,null,null,null,null,null,null,null,null,null,null,null,null,null,null,null,null,null,null,null,null,null,null,null,null,null,null,null,null,null,null,null,null,null,null,null,null,null,null,null,null,null,null,null,null,null,null,null,null,null,null,null,null,null,null,null,null,null,null,null,null,null,null,null,null,null,null,"."]
[null,null,null,null,null,null,null,null,null,null,null,null,null,null,null,null,null,null,null,null,null,null,null,null,null,null,null,null,null,null,null,null,null,null,null,null,null,null,null,null,null,null,null,null,null,null,null,null,null,null,null,null,null,null,null,null,null,null,null,null,null,null,null,null,null,null,null,null,null,null,null,null,null,null,null,null,null,null,null,null,null,null,null,null,null,null,null,null,null,null,null,null,null,null,null,null,null,null,null,null,null,null,null,null,null,null,null,null,null,null,null,null,null,null,null,null,null,null,null,null,null,null,null,null,null,null,null,null,null,null,null,null,null,null,null,null,null,null,null,"."]
[null,null,null,null,null,null,null,null,null,null,null,null,null,null,null,null,null,null,null,null,null,null,null,null,null,null,null,null,null,null,null,null,null,null,null,null,null,null,null,null,null,null,null,null,null,null,null,null,null,null,null,null,null,null,null,null,null,null,null,null,null,null,null,null,null,null,null,null,null,null,null,null,null,null,null,null,null,null,null,null,null,null,null,null,null,null,null,null,null,null,null,null,null,null,null,null,null,null,null,null,null,null,null,null,null,null,null,null,null,null,null,null,null,null,null,null,null,null,null,null,null,null,null,null,null,null,null,null,null,null,null,null,null,null,null,null,null,null,null,"."]
[null,null,null,null,null,null,null,null,null,null,null,null,null,null,null,null,null,null,null,null,null,null,null,null,null,null,null,null,null,null,null,null,null,null,null,null,null,null,null,null,null,null,null,null,null,null,null,null,null,null,null,null,null,null,null,null,null,null,null,null,null,null,null,null,null,null,null,null,null,null,null,null,null,null,null,null,null,null,null,null,null,null,null,null,null,null,null,null,null,null,null,null,null,null,null,null,null,null,null,null,null,null,null,null,null,null,null,null,null,null,null,null,null,null,null,null,null,null,null,null,null,null,null,null,null,null,null,null,null,null,null,null,null,null,null,null,null,null,null,"."]

{"sheet":"Metal Snares","index":2,"n_rows":96,"n_cols":66,"rows_kept":96,"cut":false,"hidden":true,"merged":[]}
[null,"Metal Snare Order Guide"]
[null,null,"METALSDCUSTOM"]
[]
[null,null,"Shell","Size","List ",null,null,null,null,null,null,null,null,null,null,"Codification",null,null,null,"Qty if ",null,null,"Shell","Size","Base","Base + ",null,null,null,null,null,null,null,null,"Conflicts",null,null,null,null,null,null,null,null,null,null,null,null,null,null,null,"Code to Match Standard Items"]
[null,null,"Chromed Aluminum",null,"Price","Codification","Hardware","Plating Conflict",null,null,null,null,null,null,"Drum","Lugs","Hoops","Throwoff","Plating","Chosen","Chosen","Qty ","Chromed Aluminum",null,"Price","Options",null,"Hardware",null,"List Price",null,"Codification","SI Match",null,"Brass vs Everything",null,null,null,null,null,null,null,null,null,null,null,null,null,null,null,"This Drum","SI","isError"]
[null,null,"LM400","5x14",{"$f":"IF(U6=1,Z6,Y6)","v":695},{"$f":"IF(BA6=TRUE,CONCATENATE(O6,P6,Q6,R6,S6,\" Cstm\"),CONCATENATE(\"Standard Item \",AZ6))","v":"LM410D Cstm"},null,"Chrome",null,null,null,null,null,null,{"$f":"IF($AB$16=1,\"LM410\",\"LM400\")","v":"LM410"},{"$f":"IF($AB$11=1,\"T\",\"\")","v":""},{"$f":"IF($AB$26=1,\"D\",\"\")","v":"D"},{"$f":"IF($AB$15=1,\"WM\",\"\")","v":""},{"$f":"IF($AB$7=1,\"B\",\"\")","v":""},{"$f":"IF(ISNUMBER(B6)=TRUE,B6,1)","v":1},{"$f":"IF(B6=\"\",0,1)","v":0},{"$f":"IF(B6=\"\",0,T6)","v":0},"LM400","5x14",695,{"$f":"IF(U6=1,V6*(Y6+$AE$36),0)","v":0},null,{"$f":"IF(G6=\"\",0,1)","v":0},"Chrome",0,{"$f":"AB6*AD6","v":0},null,"C",null,null,null,null,null,{"$f":"+$V$6","v":0},"LM400","5x14",null,{"$f":"+$V$6","v":0},"LM400","5x14",null,"throwoff vs Butt",null,null,null,{"$f":"IF(U6=1,CONCATENATE(W6,$AF$39,$AG$39,$AH$39,$AI$39,$AJ$39,$AK$39,$AL$39),\"\")","v":""},{"$f":"VLOOKUP(AY6,$BD$10:$BE$96,2,FALSE)","v":{"$error":"#N/A"}},{"$f":"ISERROR(AZ6)","v":true}]
[null,null,"LM402","6.5x14",{"$f":"IF(U7=1,Z7,Y7)","v":745},{"$f":"IF(BA7=TRUE,CONCATENATE(O7,P7,Q7,R7,S7,\" Cstm\"),CONCATENATE(\"Standard Item \",AZ7))","v":"LM411D Cstm"},null,"Brass",null,null,null,null,null,null,{"$f":"IF($AB$16=1,\"LM411\",\"LM402\")","v":"LM411"},{"$f":"IF($AB$11=1,\"T\",\"\")","v":""},{"$f":"IF($AB$26=1,\"D\",\"\")","v":"D"},{"$f":"IF($AB$15=1,\"WM\",\"\")","v":""},{"$f":"IF($AB$7=1,\"B\",\"\")","v":""},{"$f":"IF(ISNUMBER(B7)=TRUE,B7,1)","v":1},{"$f":"IF(B7=\"\",0,1)","v":0},{"$f":"IF(B7=\"\",0,T7)","v":0},"LM402","6.5x14",745,{"$f":"IF(U7=1,V7*(Y7+$AE$36),0)","v":0},null,{"$f":"IF(G7=\"\",0,1)","v":0},"Brass",60,{"$f":"AB7*AD7","v":0},null,"B",null,"Plating vs Shell",null,null,null,{"$f":"+$V$7","v":0},"LM402","6.5x14",null,{"$f":"+$V$9","v":0},"LM400K","5x14",null,{"$f":"IF(AB22*(AB14+AB15+AB17)>0,1,0)","v":0},"SS Butt vs lever throwoff",null,null,{"$f":"IF(U7=1,CONCATENATE(W7,$AF$39,$AG$39,$AH$39,$AI$39,$AJ$39,$AK$39,$AL$39),\"\")","v":""},{"$error":"#N/A"},{"$f":"ISERROR(AZ7)","v":true}]
[null,null,"Chromed Hammered Aluminum",null,null,null,null,null,null,null,null,null,null,null,null,null,null,null,null,null,null,null,"Chromed Hammered Aluminum",null,null,null,null,{"$f":"SUM(AB6:AB7)","v":0},null,null,null,null,null,null,{"$f":"+V15","v":0},"LB553B",null,null,{"$f":"+$V$9","v":0},"LM400K","5x14",null,{"$f":"+$V$12","v":0},"LB400B","5x14",null,{"$f":"+AB16*(AB20+AB21)","v":0},"SS Throwoff vs Clamp butt",null,null,null,{"$error":"#N/A"},true]
[null,null,"LM400K","5x14",{"$f":"IF(U9=1,Z9,Y9)","v":745},{"$f":"IF(BA9=TRUE,CONCATENATE(O9,P9,Q9,R9,S9,\" Cstm\"),CONCATENATE(\"Standard Item \",AZ9))","v":"LM410KD Cstm"},"Lugs",null,null,null,null,null,null,null,{"$f":"IF($AB$16=1,\"LM410K\",\"LM400K\")","v":"LM410K"},{"$f":"IF($AB$11=1,\"T\",\"\")","v":""},{"$f":"IF($AB$26=1,\"D\",\"\")","v":"D"},{"$f":"IF($AB$15=1,\"WM\",\"\")","v":""},{"$f":"IF($AB$7=1,\"B\",\"\")","v":""},{"$f":"IF(ISNUMBER(B9)=TRUE,B9,1)","v":1},{"$f":"IF(B9=\"\",0,1)","v":0},{"$f":"IF(B9=\"\",0,T9)","v":0},"LM400K","5x14",745,{"$f":"IF(U9=1,V9*(Y9+$AE$36),0)","v":0},null,"Lugs",null,"List Price",null,null,null,null,{"$f":"+V23","v":0},"LB420K",null,null,{"$f":"+$V$10","v":0},"LM402K","6.5x14",null,{"$f":"+$V$16","v":1},"LB416","5x14",null,{"$f":"SUM(AU7:AU8)","v":0},"any error",null,null,{"$f":"IF(U9=1,CONCATENATE(W9,$AF$39,$AG$39,$AH$39,$AI$39,$AJ$39,$AK$39,$AL$39),\"\")","v":""},{"$error":"#N/A"},true,null,null,"SI Code","Item Number","Description","Drum","Hardware","Lugs","Throwoff","Butt","Hoops","Tone Control","Batter"]
[null,null,"LM402K","6.5x14",{"$f":"IF(U10=1,Z10,Y10)","v":795},{"$f":"IF(BA10=TRUE,CONCATENATE(O10,P10,Q10,R10,S10,\" Cstm\"),CONCATENATE(\"Standard Item \",AZ10))","v":"LM411KD Cstm"},null,{"$f":"VLOOKUP(1,AM31:AN34,2,FALSE)","v":"Imperial"},null,null,null,null,null,null,{"$f":"IF($AB$16=1,\"LM411K\",\"LM402K\")","v":"LM411K"},{"$f":"IF($AB$11=1,\"T\",\"\")","v":""},{"$f":"IF($AB$26=1,\"D\",\"\")","v":"D"},{"$f":"IF($AB$15=1,\"WM\",\"\")","v":""},{"$f":"IF($AB$7=1,\"B\",\"\")","v":""},{"$f":"IF(ISNUMBER(B10)=TRUE,B10,1)","v":1},{"$f":"IF(B10=\"\",0,1)","v":0},{"$f":"IF(B10=\"\",0,T10)","v":0},"LM402K","6.5x14",795,{"$f":"IF(U10=1,V10*(Y10+$AE$36),0)","v":0},null,{"$f":"IF(G10=\"\",0,1)","v":0},"Imperial",0,{"$f":"AB10*AD10","v":0},null,"I",null,{"$f":"+V24","v":0},"LB422K",null,null,{"$f":"+$V$12","v":0},"LB400B","5x14",null,{"$f":"+$V$20","v":0},"LB416K","5x14",null,null,null,null,null,{"$f":"IF(U10=1,CONCATENATE(W10,$AF$39,$AG$39,$AH$39,$AI$39,$AJ$39,$AK$39,$AL$39),\"\")","v":""},{"$error":"#N/A"},true,null,null,{"$f":"CONCATENATE(BG10,BH10,BI10,BJ10,BK10,BL10,BM10,BN10)","v":"LB400BCI533N3"},"LB400B","5X14 CHROMED BRASS SNARE","LB400B","C","I",5,3,3,"N",3]
[null,null,"Chromed Brass",null,null,null,null,"Tube",null,null,null,null,null,null,null,null,null,null,null,null,null,null,"Chromed Brass",null,null,null,null,{"$f":"IF(G11=\"\",0,1)","v":0},"Tube",45,{"$f":"AB11*AD11","v":0},"T","T",null,{"$f":"+V19","v":0},"LB553BK",null,null,{"$f":"+$V$13","v":0},"LB402B","6.5x14",null,{"$f":"+$V$23","v":0},"LB420K","5x14",null,"Size vs Hoop",null,null,null,null,{"$error":"#N/A"},true,null,null,"LB400BBT63DN3","LB400BBTWM","5X14 CHROME BRASS W/BRASS TRIM","LB400B","B","T",6,3,"D","N",3]
[null,null,"LB400B","5x14",{"$f":"IF(U12=1,Z12,Y12)","v":865},{"$f":"IF(BA12=FALSE,CONCATENATE(\"Standard Item \",AZ12),IF($AB$7=1,CONCATENATE(O12,S12,P12,R12,\" Cstm\"),CONCATENATE(O12,P12,Q12,R12,\" Cstm\")))","v":"LB400BD Cstm"},null,null,null,null,null,null,null,null,"LB400B",{"$f":"IF($AB$11=1,\"T\",\"\")","v":""},{"$f":"IF($AB$26=1,\"D\",\"\")","v":"D"},{"$f":"IF($AB$15=1,\"WM\",\"\")","v":""},{"$f":"IF($AB$7=1,\"B\",\"\")","v":""},{"$f":"IF(ISNUMBER(B12)=TRUE,B12,1)","v":1},{"$f":"IF(B12=\"\",0,1)","v":0},{"$f":"IF(B12=\"\",0,T12)","v":0},"LB400B","5x14",865,{"$f":"IF(U12=1,V12*(Y12+$AE$36),0)","v":0},null,{"$f":"SUM(AB10:AB11)","v":0},null,null,null,null,null,null,{"$f":"+V26","v":0},"LB550",null,null,{"$f":"+$V$16","v":1},"LB416","5x14",null,{"$f":"+$V$26","v":0},"LB550","5x14",null,{"$f":"+U15+U19","v":0},"piccolo size",null,null,{"$f":"IF(U12=1,CONCATENATE(W12,$AF$39,$AG$39,$AH$39,$AI$39,$AJ$39,$AK$39,$AL$39),\"\")","v":""},{"$error":"#N/A"},true,null,null,"LB400BCT533N3","LB400BT","5X14 CHRMD BRASS SNARE-TUBE LG","LB400B","C","T",5,3,3,"N",3]
[null,null,"LB402B","6.5x14",{"$f":"IF(U13=1,Z13,Y13)","v":900},{"$f":"IF(BA13=FALSE,CONCATENATE(\"Standard Item \",AZ13),IF($AB$7=1,CONCATENATE(O13,S13,P13,R13,\" Cstm\"),CONCATENATE(O13,P13,Q13,R13,\" Cstm\")))","v":"LB402BD Cstm"},"Throwoff","Size/Throwoff Conflict",null,null,null,null,null,null,"LB402B",{"$f":"IF($AB$11=1,\"T\",\"\")","v":""},{"$f":"IF($AB$26=1,\"D\",\"\")","v":"D"},{"$f":"IF($AB$15=1,\"WM\",\"\")","v":""},{"$f":"IF($AB$7=1,\"B\",\"\")","v":""},{"$f":"IF(ISNUMBER(B13)=TRUE,B13,1)","v":1},{"$f":"IF(B13=\"\",0,1)","v":0},{"$f":"IF(B13=\"\",0,T13)","v":0},"LB402B","6.5x14",900,{"$f":"IF(U13=1,V13*(Y13+$AE$36),0)","v":0},null,"Throwoff",null,null,null,null,null,null,{"$f":"+V27","v":0},"KB552",null,null,{"$f":"+$V$17","v":0},"LB417","6.5x14",null,{"$f":"+$V$29","v":0},"LB550K","5x14",null,{"$f":"+AB26","v":1},"Die Cast hoops",null,null,{"$f":"IF(U13=1,CONCATENATE(W13,$AF$39,$AG$39,$AH$39,$AI$39,$AJ$39,$AK$39,$AL$39),\"\")","v":""},{"$error":"#N/A"},true,null,null,"LB400BCT633N3","LB400BTM","5X14 CHROMED BRASS SNARE","LB400B","C","T",6,3,3,"N",3]
[null,null,"Black Beauty",null,null,null,null,"P85 Supraphonic",null,null,null,null,null,null,null,null,null,null,null,null,null,null,"Black Beauty",null,null,null,null,{"$f":"IF(G14=\"\",0,1)","v":0},"P85 Supraphonic",0,{"$f":"AB14*AD14","v":0},null,5,null,null,null,null,null,{"$f":"+$V$20","v":0},"LB416K","5x14",null,{"$f":"SUM(AQ6:AQ13)","v":1},"total 5x14",null,null,{"$f":"SUM(AU12:AU13)","v":1},"error if >1",null,null,null,{"$error":"#N/A"},true,null,null,"LB400BCI633N3","LB400BWM","5X14 CHROMED BRASS SNARE","LB400B","C","I",6,3,3,"N",3]
[null,null,"LB553B","3.5x13",{"$f":"IF(U15=1,Z15,Y15)","v":1010},{"$f":"IF(BA15=TRUE,CONCATENATE(O15,P15,Q15,R15,S15,\" Cstm\"),CONCATENATE(\"Standard Item \",AZ15))","v":"LB553B Cstm"},null,"P86 Millennium",null,null,null,null,null,null,"LB553B",{"$f":"IF($AB$11=1,\"T\",\"\")","v":""},null,null,null,{"$f":"IF(ISNUMBER(B15)=TRUE,B15,1)","v":1},{"$f":"IF(B15=\"\",0,1)","v":0},{"$f":"IF(B15=\"\",0,T15)","v":0},"LB553B","3.5x14",1010,{"$f":"IF(U15=1,V15*(Y15+$AE$36),0)","v":0},null,{"$f":"IF(G15=\"\",0,1)","v":0},"P86 Millennium",45,{"$f":"AB15*AD15","v":0},"WM",6,null,{"$f":"+V29","v":0},"LB550K",null,null,{"$f":"+$V$21","v":0},"LB417K","6.5x14",null,null,null,null,null,null,null,null,null,{"$f":"IF(U15=1,CONCATENATE(W15,$AF$39,$AG$39,$AH$39,$AI$39,$AJ$39,$AK$39,$AL$39),\"\")","v":""},{"$error":"#N/A"},true,null,null,"LB402BCI533N3","LB402B","6 1/2 X 14 CHRMD BRASS SNARE","LB402B","C","I",5,3,3,"N",3]
[null,"x","LB416","5x14",{"$f":"IF(U16=1,Z16,Y16)","v":1365},{"$f":"IF(BA16=FALSE,CONCATENATE(\"Standard Item \",AZ16),IF($AB$7=1,CONCATENATE(O16,S16,P16,R16,\" Cstm\"),CONCATENATE(O16,P16,Q16,R16,\" Cstm\")))","v":"LB418D Cstm"},"d",{"$f":"VLOOKUP(1,AQ31:AR34,2,FALSE)","v":"P70 SuperSensitive"},null,null,null,null,null,null,{"$f":"IF($AB$16=1,\"LB418\",\"LB416\")","v":"LB418"},{"$f":"IF($AB$11=1,\"T\",\"\")","v":""},{"$f":"IF($AB$26=1,\"D\",\"\")","v":"D"},{"$f":"IF($AB$15=1,\"WM\",\"\")","v":""},{"$f":"IF($AB$7=1,\"B\",\"\")","v":""},{"$f":"IF(ISNUMBER(B16)=TRUE,B16,1)","v":1},{"$f":"IF(B16=\"\",0,1)","v":1},{"$f":"IF(B16=\"\",0,T16)","v":1},"LB416","5x14",1010,{"$f":"IF(U16=1,V16*(Y16+$AE$36),0)","v":1365},null,{"$f":"IF(G16=\"\",0,1)","v":1},"P70/P71 Supraphonic",270,{"$f":"AB16*AD16","v":270},null,7,null,{"$f":"+V30","v":0},"LB552K",null,null,{"$f":"+$V$23","v":0},"LB420K","5x14",null,{"$f":"+$V$7","v":0},"LM402","6.5x14",null,{"$f":"+AB14+AB15+AB17","v":0},"Insensitive",null,null,{"$f":"IF(U16=1,CONCATENATE(W16,$AF$39,$AG$39,$AH$39,$AI$39,$AJ$39,$AK$39,$AL$39),\"\")","v":"LB416CI77DN3"},{"$error":"#N/A"},true,null,null,"LB402BBT63DN3","LB402BBTWM","6.5X14 CRM BRASS W/BRASS TRIM","LB402B","B","T",6,3,"D","N",3]
[null,null,"LB417","6.5x14",{"$f":"IF(U17=1,Z17,Y17)","v":1065},{"$f":"IF(BA17=FALSE,CONCATENATE(\"Standard Item \",AZ17),IF($AB$7=1,CONCATENATE(O17,S17,P17,R17,\" Cstm\"),CONCATENATE(O17,P17,Q17,R17,\" Cstm\")))","v":"LB419D Cstm"},null,"P80 Piccolo",null,null,null,null,null,null,{"$f":"IF($AB$16=1,\"LB419\",\"LB417\")","v":"LB419"},{"$f":"IF($AB$11=1,\"T\",\"\")","v":""},{"$f":"IF($AB$26=1,\"D\",\"\")","v":"D"},{"$f":"IF($AB$15=1,\"WM\",\"\")","v":""},{"$f":"IF($AB$7=1,\"B\",\"\")","v":""},{"$f":"IF(ISNUMBER(B17)=TRUE,B17,1)","v":1},{"$f":"IF(B17=\"\",0,1)","v":0},{"$f":"IF(B17=\"\",0,T17)","v":0},"LB417","6.5x14",1065,{"$f":"IF(U17=1,V17*(Y17+$AE$36),0)","v":0},null,{"$f":"IF(G17=\"\",0,1)","v":0},"P80 Piccolo",0,{"$f":"AB17*AD17","v":0},null,8,null,{"$f":"SUM(AI8:AI16)","v":0},"Total Sizes",null,null,{"$f":"+$V$24","v":0},"LB422K","6.5x14",null,{"$f":"+$V$10","v":0},"LM402K","6.5x14",null,{"$f":"+AB16","v":1},"SuperSensitive",null,null,{"$f":"IF(U17=1,CONCATENATE(W17,$AF$39,$AG$39,$AH$39,$AI$39,$AJ$39,$AK$39,$AL$39),\"\")","v":""},{"$error":"#N/A"},true,null,null,{"$f":"CONCATENATE(BG17,BH17,BI17,BJ17,BK17,BL17,BM17,BN17)","v":"LB402BCT533N3"},"LB402BT","6.5X14 CHRMD BRASS SNARE-TB LG","LB402B","C","T",5,3,3,"N",3]
[null,null,"Hammered Black Beauty",null,null,null,null,null,null,null,null,null,null,null,null,null,null,null,null,null,null,null,"Hammered Black Beauty",null,null,null,null,{"$f":"SUM(AB14:AB17)","v":1},null,null,null,null,null,null,null,null,null,null,{"$f":"+$V$26","v":0},"LB550","5x14",null,{"$f":"+$V$13","v":0},"LB402B","6.5x14",null,null,null,null,null,null,{"$error":"#N/A"},true,null,null,"LB402BCT633N3","LB402BTWM","6.5X14 CHRMD BRASS SNARE-TB LG","LB402B","C","T",6,3,3,"N",3]
[null,null,"LB553BK","3.5x13",{"$f":"IF(U19=1,Z19,Y19)","v":1060},{"$f":"IF(BA19=TRUE,CONCATENATE(O19,P19,Q19,R19,S19,\" Cstm\"),CONCATENATE(\"Standard Item \",AZ19))","v":"LB553BK Cstm"},"Butt","Butt/Throwoff Conflict",null,null,null,null,null,null,"LB553BK",{"$f":"IF($AB$11=1,\"T\",\"\")","v":""},null,null,null,{"$f":"IF(ISNUMBER(B19)=TRUE,B19,1)","v":1},{"$f":"IF(B19=\"\",0,1)","v":0},{"$f":"IF(B19=\"\",0,T19)","v":0},"LB553BK","3.5x14",1060,{"$f":"IF(U19=1,V19*(Y19+$AE$36),0)","v":0},null,"Butt",null,null,null,null,null,null,{"$f":"+AB10","v":0},"Imperial",null,null,{"$f":"+$V$27","v":0},"KB552","6.5x14",null,{"$f":"+$V$17","v":0},"LB417","6.5x14",null,null,null,null,null,{"$f":"IF(U19=1,CONCATENATE(W19,$AF$39,$AG$39,$AH$39,$AI$39,$AJ$39,$AK$39,$AL$39),\"\")","v":""},{"$error":"#N/A"},true,null,null,"LB402BCI633N3","LB402BWM","6 1/2 X 14 CHRMD BRASS SNARE","LB402B","C","I",6,3,3,"N",3]
[null,null,"LB416K","5x14",{"$f":"IF(U20=1,Z20,Y20)","v":1060},{"$f":"IF(BA20=TRUE,CONCATENATE(O20,P20,Q20,R20,S20,\" Cstm\"),CONCATENATE(\"Standard Item \",AZ20))","v":"LB418KD Cstm"},null,"P33 Die Cast",null,null,null,null,null,null,{"$f":"IF($AB$16=1,\"LB418K\",\"LB416K\")","v":"LB418K"},{"$f":"IF($AB$11=1,\"T\",\"\")","v":""},{"$f":"IF($AB$26=1,\"D\",\"\")","v":"D"},{"$f":"IF($AB$15=1,\"WM\",\"\")","v":""},{"$f":"IF($AB$7=1,\"B\",\"\")","v":""},{"$f":"IF(ISNUMBER(B20)=TRUE,B20,1)","v":1},{"$f":"IF(B20=\"\",0,1)","v":0},{"$f":"IF(B20=\"\",0,T20)","v":0},"LB416K","5x14",1060,{"$f":"IF(U20=1,V20*(Y20+$AE$36),0)","v":0},null,{"$f":"IF(G20=\"\",0,1)","v":0},"P33 Die Cast",0,{"$f":"AB20*AD20","v":0},null,3,null,{"$f":"+AB14","v":0},"P85 Supraphonic",null,null,{"$f":"+$V$29","v":0},"LB550K","5x14",null,{"$f":"+$V$21","v":0},"LB417K","6.5x14",null,null,null,null,null,{"$f":"IF(U20=1,CONCATENATE(W20,$AF$39,$AG$39,$AH$39,$AI$39,$AJ$39,$AK$39,$AL$39),\"\")","v":""},{"$error":"#N/A"},true,null,null,"LB416CI533N3","LB416","5X14 SUPRA-PHONIC BLACK BEAUTY","LB416","C","I",5,3,3,"N",3]
[null,null,"LB417K","6.5x14",{"$f":"IF(U21=1,Z21,Y21)","v":1120},{"$f":"IF(BA21=TRUE,CONCATENATE(O21,P21,Q21,R21,S21,\" Cstm\"),CONCATENATE(\"Standard Item \",AZ21))","v":"LB419KD Cstm"},null,"P32 DISCONTINUED",null,null,null,null,null,null,{"$f":"IF($AB$16=1,\"LB419K\",\"LB417K\")","v":"LB419K"},{"$f":"IF($AB$11=1,\"T\",\"\")","v":""},{"$f":"IF($AB$26=1,\"D\",\"\")","v":"D"},{"$f":"IF($AB$15=1,\"WM\",\"\")","v":""},{"$f":"IF($AB$7=1,\"B\",\"\")","v":""},{"$f":"IF(ISNUMBER(B21)=TRUE,B21,1)","v":1},{"$f":"IF(B21=\"\",0,1)","v":0},{"$f":"IF(B21=\"\",0,T21)","v":0},"LB417K","6.5x14",1120,{"$f":"IF(U21=1,V21*(Y21+$AE$36),0)","v":0},null,{"$f":"IF(G21=\"\",0,1)","v":0},"P32 Stamped",-2.5499999999999998,{"$f":"AB21*AD21","v":0},null,2,null,{"$f":"+AB16","v":1},"P70/P71 Supraphonic",null,null,{"$f":"+$V$30","v":0},"LB552K","6.5x14",null,{"$f":"+$V$24","v":0},"LB422K","6.5x14",null,null,null,null,null,{"$f":"IF(U21=1,CONCATENATE(W21,$AF$39,$AG$39,$AH$39,$AI$39,$AJ$39,$AK$39,$AL$39),\"\")","v":""},{"$error":"#N/A"},true,null,null,"LB416BT63DN3","LB416BT","5X14 BLACK BEAUTY W/BRASS TRIM","LB416","B","T",6,3,"D","N",3]
[null,null,"Hammered Brass",null,null,null,null,{"$f":"VLOOKUP(1,AQ31:AR34,2,FALSE)","v":"P70 SuperSensitive"},null,null,null,null,null,null,null,null,null,null,null,null,null,null,"Hammered Brass",null,null,null,null,{"$f":"IF(G22=\"\",0,1)","v":0},"P70/P71 Supraphonic",0,{"$f":"AB22*AD22","v":0},null,7,null,{"$f":"+AB17","v":0},"P80 Piccolo",null,null,{"$f":"SUM(AM6:AM21)","v":1},null,null,null,{"$f":"+$V$27","v":0},"KB552","6.5x14",null,null,null,null,null,null,{"$error":"#N/A"},true,null,null,"LB416KCI533N3","LB416K","5X14 HMMRD BLK BTY W/P85","LB416K","C","I",5,3,3,"N",3]
[null,null,"LB420BK","5x14",{"$f":"IF(U23=1,Z23,Y23)","v":895},{"$f":"IF(BA23=TRUE,CONCATENATE(O23,P23,Q23,R23,S23,\" Cstm\"),CONCATENATE(\"Standard Item \",AZ23))","v":"LB420KD Cstm"},null,null,null,null,null,null,null,null,"LB420K",{"$f":"IF($AB$11=1,\"T\",\"\")","v":""},{"$f":"IF($AB$26=1,\"D\",\"\")","v":"D"},{"$f":"IF($AB$15=1,\"WM\",\"\")","v":""},null,{"$f":"IF(ISNUMBER(B23)=TRUE,B23,1)","v":1},{"$f":"IF(B23=\"\",0,1)","v":0},{"$f":"IF(B23=\"\",0,T23)","v":0},"LB420K","5x14",895,{"$f":"IF(U23=1,V23*(Y23+$AE$36),0)","v":0},null,{"$f":"SUM(AB20:AB22)","v":0},null,null,null,null,null,null,{"$f":"+AB21","v":0},"P32 Stamped",null,null,null,null,null,null,{"$f":"+$V$30","v":0},"LB552K","6.5x14",null,null,null,null,null,{"$f":"IF(U23=1,CONCATENATE(W23,$AF$39,$AG$39,$AH$39,$AI$39,$AJ$39,$AK$39,$AL$39),\"\")","v":""},{"$error":"#N/A"},true,null,null,"LB416KCT533N3","LB416KT","5X14 HMMRD BLK BTY W/TUBE LUGS","LB416K","C","T",5,3,3,"N",3]
[null,null,"LB422BK","6.5x14",{"$f":"IF(U24=1,Z24,Y24)","v":970},{"$f":"IF(BA24=TRUE,CONCATENATE(O24,P24,Q24,R24,S24,\" Cstm\"),CONCATENATE(\"Standard Item \",AZ24))","v":"LB422KD Cstm"},"Hoops","Size/Hoop Conflict",null,null,null,null,null,null,"LB422K",{"$f":"IF($AB$11=1,\"T\",\"\")","v":""},{"$f":"IF($AB$26=1,\"D\",\"\")","v":"D"},{"$f":"IF($AB$15=1,\"WM\",\"\")","v":""},null,{"$f":"IF(ISNUMBER(B24)=TRUE,B24,1)","v":1},{"$f":"IF(B24=\"\",0,1)","v":0},{"$f":"IF(B24=\"\",0,T24)","v":0},"LB422K","6.5x14",970,{"$f":"IF(U24=1,V24*(Y24+$AE$36),0)","v":0},null,"Hoops",null,null,null,null,null,null,{"$f":"+AB22","v":0},"P70/P71 Supraphonic",null,null,null,null,null,null,{"$f":"SUM(AQ16:AQ23)","v":0},"total 6.5x14",null,null,null,null,null,null,{"$f":"IF(U24=1,CONCATENATE(W24,$AF$39,$AG$39,$AH$39,$AI$39,$AJ$39,$AK$39,$AL$39),\"\")","v":""},{"$error":"#N/A"},true,null,null,"LB416KCT633N3","LB416KTWM","5X14 HMMRD BLK BTY W/TUBE LUGS","LB416K","C","T",6,3,3,"N",3]
[null,null,"Bronze",null,null,null,null,"3F Triple Flanged",null,null,null,null,null,null,null,null,null,null,null,null,null,null,"Bronze",null,null,null,null,{"$f":"IF(G25=\"\",0,1)","v":0},"3F Triple Flanged",0,{"$f":"AB25*AD25","v":0},null,3,null,{"$f":"+AB25","v":0},"3F Triple Flanged",null,null,{"$f":"+$V$15","v":0},"LB553B","3.5x14",null,null,null,null,null,null,null,null,null,null,{"$error":"#N/A"},true,null,null,"LB416CT533N3","LB416T","5X14 BLK BTY SNARE W/TUBE LUGS","LB416","C","T",5,3,3,"N",3]
[null,null,"LB550","5x14",{"$f":"IF(U26=1,Z26,Y26)","v":1070},{"$f":"IF(BA26=TRUE,CONCATENATE(O26,P26,Q26,R26,S26,\" Cstm\"),CONCATENATE(\"Standard Item \",AZ26))","v":"LB554D Cstm"},"x","PDC Die Cast",null,null,null,null,null,null,{"$f":"IF($AB$16=1,\"LB554\",\"LB550\")","v":"LB554"},{"$f":"IF($AB$11=1,\"T\",\"\")","v":""},{"$f":"IF($AB$26=1,\"D\",\"\")","v":"D"},{"$f":"IF($AB$15=1,\"WM\",\"\")","v":""},null,{"$f":"IF(ISNUMBER(B26)=TRUE,B26,1)","v":1},{"$f":"IF(B26=\"\",0,1)","v":0},{"$f":"IF(B26=\"\",0,T26)","v":0},"LB550","5x14",1070,{"$f":"IF(U26=1,V26*(Y26+$AE$36),0)","v":0},null,{"$f":"IF(G26=\"\",0,1)","v":1},"PDC Die Cast",85,{"$f":"AB26*AD26","v":85},"D","D",null,{"$f":"+AB30","v":0},"Internal Tone Control",null,null,{"$f":"+$V$19","v":0},"LB553BK","3.5x14",null,{"$f":"IF(AM22*AB17>0,1,0)","v":0},"big drums vs P80",null,null,null,null,null,null,{"$f":"IF(U26=1,CONCATENATE(W26,$AF$39,$AG$39,$AH$39,$AI$39,$AJ$39,$AK$39,$AL$39),\"\")","v":""},{"$error":"#N/A"},true,null,null,"LB416CT633N3","LB416TM","5X14 SUPRA-PHONIC BLACK BEAUTY","LB416","C","T",6,3,3,"N",3]
[null,null,"LB552","6.5x14",{"$f":"IF(U27=1,Z27,Y27)","v":1100},{"$f":"IF(BA27=TRUE,CONCATENATE(O27,P27,Q27,R27,S27,\" Cstm\"),CONCATENATE(\"Standard Item \",AZ27))","v":"LB556D Cstm"},null,null,null,null,null,null,null,null,{"$f":"IF($AB$16=1,\"LB556\",\"LB552\")","v":"LB556"},{"$f":"IF($AB$11=1,\"T\",\"\")","v":""},{"$f":"IF($AB$26=1,\"D\",\"\")","v":"D"},{"$f":"IF($AB$15=1,\"WM\",\"\")","v":""},null,{"$f":"IF(ISNUMBER(B27)=TRUE,B27,1)","v":1},{"$f":"IF(B27=\"\",0,1)","v":0},{"$f":"IF(B27=\"\",0,T27)","v":0},"LB552","6.5x14",1100,{"$f":"IF(U27=1,V27*(Y27+$AE$36),0)","v":0},null,{"$f":"SUM(AB25:AB26)","v":1},null,null,null,null,null,null,{"$f":"SUM(AI19:AI26)","v":1},"Total Conflicts",null,null,{"$f":"SUM(AM25:AM26)","v":0},null,null,null,{"$f":"IF(SUM(AB14:AB16)*AM27>0,1,0)","v":0},"Small drums vs P85, P86, P70/P71",null,null,null,null,null,null,{"$f":"IF(U27=1,CONCATENATE(W27,$AF$39,$AG$39,$AH$39,$AI$39,$AJ$39,$AK$39,$AL$39),\"\")","v":""},{"$error":"#N/A"},true,null,null,"LB416CI633N3","LB416WM","5X14 SUPRA-PHONIC BLACK BEAUTY","LB416","C","I",6,3,3,"N",3]
[null,null,"Hammered Bronze",null,null,null,"Tone Control",null,null,null,null,null,null,null,null,null,null,null,null,null,null,null,"Hammered Bronze",null,null,null,null,"Tone Control",null,null,null,null,null,null,null,null,null,null,null,null,null,null,{"$f":"SUM(AQ26:AQ27)","v":0},"Any Throwoff conflict",null,null,null,null,null,null,null,{"$error":"#N/A"},true,null,null,"LB417CI533N3","LB417","6 1/2X14 SUPRA-PHO BLK BEAUTY","LB417","C","I",5,3,3,"N",3]
[null,null,"LB550K","5x14",{"$f":"IF(U29=1,Z29,Y29)","v":1125},{"$f":"IF(BA29=TRUE,CONCATENATE(O29,P29,Q29,R29,S29,\" Cstm\"),CONCATENATE(\"Standard Item \",AZ29))","v":"LB554KD Cstm"},"x","No Tone Control",null,null,null,null,null,null,{"$f":"IF($AB$16=1,\"LB554K\",\"LB550K\")","v":"LB554K"},{"$f":"IF($AB$11=1,\"T\",\"\")","v":""},{"$f":"IF($AB$26=1,\"D\",\"\")","v":"D"},{"$f":"IF($AB$15=1,\"WM\",\"\")","v":""},null,{"$f":"IF(ISNUMBER(B29)=TRUE,B29,1)","v":1},{"$f":"IF(B29=\"\",0,1)","v":0},{"$f":"IF(B29=\"\",0,T29)","v":0},"LB550K","5x14",1125,{"$f":"IF(U29=1,V29*(Y29+$AE$36),0)","v":0},null,{"$f":"IF(G29=\"\",0,1)","v":1},"No Tone Control'",0,{"$f":"AB29*AD29","v":0},null,"N",null,{"$f":"+AI17*AB7","v":0},"Size vs Plating if >0",null,null,null,null,null,null,null,null,null,null,null,null,null,null,{"$f":"IF(U29=1,CONCATENATE(W29,$AF$39,$AG$39,$AH$39,$AI$39,$AJ$39,$AK$39,$AL$39),\"\")","v":""},{"$error":"#N/A"},true,null,null,"LB417BT63DN3","LB417BT","6.5X14 BLK BEAUTY W/BRASS TRIM","LB417","B","T",6,3,"D","N",3]
[null,null,"LB552K","6.5x14",{"$f":"IF(U30=1,Z30,Y30)","v":1155},{"$f":"IF(BA30=TRUE,CONCATENATE(O30,P30,Q30,R30,S30,\" Cstm\"),CONCATENATE(\"Standard Item \",AZ30))","v":"LB556KD Cstm"},null,"Internal Tone Control",null,null,null,null,null,null,{"$f":"IF($AB$16=1,\"LB556K\",\"LB552K\")","v":"LB556K"},{"$f":"IF($AB$11=1,\"T\",\"\")","v":""},{"$f":"IF($AB$26=1,\"D\",\"\")","v":"D"},{"$f":"IF($AB$15=1,\"WM\",\"\")","v":""},null,{"$f":"IF(ISNUMBER(B30)=TRUE,B30,1)","v":1},{"$f":"IF(B30=\"\",0,1)","v":0},{"$f":"IF(B30=\"\",0,T30)","v":0},"LB552K","6.5x14",1155,{"$f":"IF(U30=1,V30*(Y30+$AE$36),0)","v":0},null,{"$f":"IF(G30=\"\",0,1)","v":0},"Internal Tone Control",25,{"$f":"AB30*AD30","v":0},null,"T",null,{"$f":"+AI27*AB7","v":0},"Plating vs Options if >0",null,null,"Dynamic Lug Description",null,null,null,"Dynamic SuperSensitive Desc",null,null,null,null,null,null,null,{"$f":"IF(U30=1,CONCATENATE(W30,$AF$39,$AG$39,$AH$39,$AI$39,$AJ$39,$AK$39,$AL$39),\"\")","v":""},{"$error":"#N/A"},true,null,null,"LB417KCI533N3","LB417K","6 1/2 X 14 HMMRD BLK BTY W/P85","LB417K","C","I",5,3,3,"N",3]
[null,null,null,null,null,null,null,null,null,null,null,null,null,null,null,null,null,null,null,null,null,null,null,null,null,null,null,{"$f":"SUM(AB29:AB30)","v":1},null,null,null,null,null,null,{"$f":"SUM(AI29:AI30)","v":0},"Plating error if > 0",null,null,{"$f":"IF(AND(AM22>0,AM27=0),1,0)","v":1},"Imperial",null,null,{"$f":"IF(AND(AQ14>0,AQ24=0),1,0)","v":1},"P70 SuperSensitive",null,null,null,null,null,null,null,null,null,null,null,"LB417KCI633N3","LB417KM","6 1/2X14 SUPRA-PHO BLK BEAUTY","LB417K","C","I",6,3,3,"N",3]
[null,null,null,null,null,null,"Batter Head",null,null,null,null,null,null,null,null,null,null,null,null,null,null,null,null,null,"Order Total",{"$f":"SUM(Z6:Z30)","v":1365},null,"Batter Head",null,null,null,null,null,null,null,null,null,null,{"$f":"IF(AND(AM27>0,AM22=0),1,0)","v":0},"Classic",null,null,{"$f":"IF(AND(AQ24>0,AQ14=0),1,0)","v":0},"P71 SuperSensitive",null,null,null,null,null,null,null,null,null,null,null,"LB417KCT533N3","LB417KT","6 1/2 X 14 HMMRD BLK BTY-TB LG","LB417K","C","T",5,3,3,"N",3]
[null,null,null,null,null,null,null,"33 Medium Coated",null,null,null,null,null,null,null,null,null,null,null,null,{"$f":"SUM(U6:U31)","v":1},null,null,null,null,null,null,{"$f":"IF(G33=\"\",0,1)","v":0},"33 Medium Coated",0,{"$f":"AB33*AD33","v":0},null,3,null,null,null,null,null,{"$f":"IF(AND(AM22>0,AM27>0),1,0)","v":0},"Imperial/Classic",null,null,{"$f":"IF(AND(AQ14>0,AQ24>0),1,0)","v":0},"P70/P71 SuperSensitive",null,null,null,null,null,null,null,null,null,null,null,"LB417KCT633N3","LB417KTWM","6 1/2 X 14 HMMRD BLK BTY-TB LG","LB417K","C","T",6,3,3,"N",3]
[null,null,null,null,null,null,null,"43 Heavy Coated",null,null,null,null,null,null,null,null,null,null,null,null,null,null,null,null,null,null,null,{"$f":"IF(G34=\"\",0,1)","v":0},"43 Heavy Coated",0,{"$f":"AB34*AD34","v":0},null,4,null,null,null,null,null,{"$f":"IF(AM22+AM27=0,1,0)","v":0},"Imperial",null,null,{"$f":"IF(AND(AQ14=0,AQ24=0),1,0)","v":0},"P70/P71 SuperSensitive",null,null,null,null,null,null,null,null,null,null,null,"LB417CI633N3","LB417M","6 1/2X14 SUPRA-PHO BLK BEAUTY","LB417","C","I",6,3,3,"N",3]
[null,null,null,null,null,null,null,null,null,null,null,null,null,null,null,null,null,null,null,null,null,null,null,null,null,null,null,{"$f":"SUM(AB33:AB34)","v":0},null,null,null,null,null,null,null,null,null,null,"lug desc is vlookuped from here.",null,null,null,"SS desc is vlookuped from here.",null,null,null,null,null,null,null,null,null,null,null,null,"LB417CT533N3","LB417T","6 1/2 X 14 BLK BTY W/TUBE LUGS","LB417","C","T",5,3,3,"N",3]
[null,null,null,null,null,null,null,null,null,null,null,null,null,null,null,null,null,null,null,null,null,null,null,null,null,null,null,null,null,"Total Options",{"$f":"SUM(AE6:AE34)","v":355},null,null,null,null,null,null,null,null,null,null,null,null,null,null,null,null,null,null,null,null,null,null,null,null,"LB417CT633N3","LB417TWM","6 1/2 X 14 BLK BTY W/TUBE LUGS","LB417","C","T",6,3,3,"N",3]
[null,null,null,null,null,null,null,null,null,null,null,null,null,null,null,null,null,null,null,null,null,null,null,null,null,null,null,null,null,null,null,"Drum matching code generated here.",null,null,null,null,null,null,null,null,null,null,null,null,null,null,null,null,null,null,null,null,null,null,null,"LB416CI773N3","LB418","5X14 SUPER-SEN BLACK BEAUTY","LB416","C","I",7,7,3,"N",3]
[null,null,null,null,null,null,null,null,null,null,null,null,null,null,null,null,null,null,null,null,null,null,null,null,null,null,null,null,null,null,null,"Hardware","Lugs","Throwoff","Butt","Hoops","Tone Control","Batter",null,null,null,null,null,null,null,null,null,null,null,null,null,null,null,null,null,"LB416KCI773N3","LB418K","5X14 HMMRD BLK BTY W/P70","LB416K","C","I",7,7,3,"N",3]
[null,null,null,null,null,null,null,null,null,null,null,null,null,null,null,null,null,null,null,null,null,null,null,null,null,null,null,null,null,null,null,{"$f":"IF(AB8=1,VLOOKUP(1,AB6:AG7,6,FALSE),\"C\")","v":"C"},{"$f":"IF(AB12=1,VLOOKUP(1,AB10:AG11,6,FALSE),\"I\")","v":"I"},{"$f":"IF(AB18=1,VLOOKUP(1,AB14:AG17,6,FALSE),IF(AM27>0,8,5))","v":7},{"$f":"IF(AB23=1,VLOOKUP(1,AB20:AG22,6,FALSE),IF(AB16=1,7,3))","v":7},{"$f":"IF(AB27=1,VLOOKUP(1,AB25:AG26,6,FALSE),IF(AB7=1,\"D\",3))","v":"D"},{"$f":"IF(AB31=1,VLOOKUP(1,AB29:AG30,6,FALSE),\"N\")","v":"N"},{"$f":"IF(AB35=1,VLOOKUP(1,AB33:AG34,6,FALSE),3)","v":3},null,null,null,null,null,null,null,null,null,null,null,null,null,null,null,null,null,"LB416KCT773N3","LB418KT","5X14 SUPER-SEN BLACK BEAUTY","LB416K","C","T",7,7,3,"N",3]
[null,null,null,null,null,null,null,null,null,null,null,null,null,null,null,null,null,null,null,null,null,null,null,null,null,null,null,null,null,null,null,null,null,null,null,null,null,null,null,null,null,null,null,null,null,null,null,null,null,null,null,null,null,null,null,"LB416CT773N3","LB418T","5X14 SUPER-SEN BLACK BEAUTY","LB416","C","T",7,7,3,"N",3]
[null,null,null,null,null,null,null,null,null,null,null,null,null,null,null,null,null,null,null,null,null,null,null,null,null,null,null,null,null,null,null,null,null,null,null,null,null,null,null,null,null,null,null,null,null,null,null,null,null,null,null,null,null,null,null,"LB417CI773N3","LB419","6 1/2X14 SUPER-SEN BLK BEAUTY","LB417","C","I",7,7,3,"N",3]
[null,null,null,null,null,null,null,null,null,null,null,null,null,null,null,null,null,null,null,null,null,null,null,null,null,null,null,null,null,null,null,null,null,null,null,null,null,null,null,null,null,null,null,null,null,null,null,null,null,null,null,null,null,null,null,"LB417KCI773N3","LB419K","6 1/2 X 14 HMMRD BLK BTY W/P70","LB417K","C","I",7,7,3,"N",3]
[null,null,null,null,null,null,null,null,null,null,null,null,null,null,null,null,null,null,null,null,null,null,null,null,null,null,null,null,null,null,null,null,null,null,null,null,null,null,null,null,null,null,null,null,null,null,null,null,null,null,null,null,null,null,null,"LB417KCT773N3","LB419KT","6 1/2X14 SUPER-SEN BLK BEAUTY","LB417K","C","T",7,7,3,"N",3]
[null,null,null,null,null,null,null,null,null,null,null,null,null,null,null,null,null,null,null,null,null,null,null,null,null,null,null,null,null,null,null,null,null,null,null,null,null,null,null,null,null,null,null,null,null,null,null,null,null,null,null,null,null,null,null,"LB417CT773N3","LB419T","6 1/2X14 SUPER-SEN BLK BEAUTY","LB417","C","T",7,7,3,"N",3]
[null,null,null,null,null,null,null,null,null,null,null,null,null,null,null,null,null,null,null,null,null,null,null,null,null,null,null,null,null,null,null,null,null,null,null,null,null,null,null,null,null,null,null,null,null,null,null,null,null,null,null,null,null,null,null,"LB420KCT533N3","LB420BKT","5X14 HAMMERED BRASS SNARE","LB420K","C","T",5,3,3,"N",3]
[null,null,null,null,null,null,null,null,null,null,null,null,null,null,null,null,null,null,null,null,null,null,null,null,null,null,null,null,null,null,null,null,null,null,null,null,null,null,null,null,null,null,null,null,null,null,null,null,null,null,null,null,null,null,null,"LB422KCT533N3","LB422BKT","6 1/2X14 HAMMERED BRASS SNARE","LB422K","C","T",5,3,3,"N",3]
[null,null,null,null,null,null,null,null,null,null,null,null,null,null,null,null,null,null,null,null,null,null,null,null,null,null,null,null,null,null,null,null,null,null,null,null,null,null,null,null,null,null,null,null,null,null,null,null,null,null,null,null,null,null,null,"LB550CI533N3","LB550","5X14 SUPRA-PHO BRONZE SNARE DR","LB550","C","I",5,3,3,"N",3]
[null,null,null,null,null,null,null,null,null,null,null,null,null,null,null,null,null,null,null,null,null,null,null,null,null,null,null,null,null,null,null,null,null,null,null,null,null,null,null,null,null,null,null,null,null,null,null,null,null,null,null,null,null,null,null,"LB550KCI533N3","LB550K","5X14 HAM'D S-PHO BRONZE SN DR","LB550K","C","I",5,3,3,"N",3]
[null,null,null,null,null,null,null,null,null,null,null,null,null,null,null,null,null,null,null,null,null,null,null,null,null,null,null,null,null,null,null,null,null,null,null,null,null,null,null,null,null,null,null,null,null,null,null,null,null,null,null,null,null,null,null,"LB550KCT533N3","LB550KT","5X14 SUPRA-PHO BRONZE SNARE DR","LB550K","C","T",5,3,3,"N",3]
[null,null,null,null,null,null,null,null,null,null,null,null,null,null,null,null,null,null,null,null,null,null,null,null,null,null,null,null,null,null,null,null,null,null,null,null,null,null,null,null,null,null,null,null,null,null,null,null,null,null,null,null,null,null,null,"LB550KCT633N3","LB550KTWM","5X14 SUPRA-PHO BRONZE SNARE DR","LB550K","C","T",6,3,3,"N",3]
[null,null,null,null,null,null,null,null,null,null,null,null,null,null,null,null,null,null,null,null,null,null,null,null,null,null,null,null,null,null,null,null,null,null,null,null,null,null,null,null,null,null,null,null,null,null,null,null,null,null,null,null,null,null,null,"LB550KCI633N3","LB550KWM","5X14 HAM'D S-PHO BRONZE SN DR","LB550K","C","I",6,3,3,"N",3]
[null,null,null,null,null,null,null,null,null,null,null,null,null,null,null,null,null,null,null,null,null,null,null,null,null,null,null,null,null,null,null,null,null,null,null,null,null,null,null,null,null,null,null,null,null,null,null,null,null,null,null,null,null,null,null,"LB550CT533N3","LB550T","5X14 BRONZE W/TUBE LUGS","LB550","C","T",5,3,3,"N",3]
[null,null,null,null,null,null,null,null,null,null,null,null,null,null,null,null,null,null,null,null,null,null,null,null,null,null,null,null,null,null,null,null,null,null,null,null,null,null,null,null,null,null,null,null,null,null,null,null,null,null,null,null,null,null,null,"LB550CT633N3","LB550TWM","5X14 BRONZE W/TUBE LUGS","LB550","C","T",6,3,3,"N",3]
[null,null,null,null,null,null,null,null,null,null,null,null,null,null,null,null,null,null,null,null,null,null,null,null,null,null,null,null,null,null,null,null,null,null,null,null,null,null,null,null,null,null,null,null,null,null,null,null,null,null,null,null,null,null,null,"LB550CI633N3","LB550WM","5X14 SUPRA-PHO BRONZE SNARE DR","LB550","C","I",6,3,3,"N",3]
[null,null,null,null,null,null,null,null,null,null,null,null,null,null,null,null,null,null,null,null,null,null,null,null,null,null,null,null,null,null,null,null,null,null,null,null,null,null,null,null,null,null,null,null,null,null,null,null,null,null,null,null,null,null,null,"LB552CI533N3","LB552","6 1/2X14 S-PHO BRONZE SNARE DR","LB552","C","I",5,3,3,"N",3]
[null,null,null,null,null,null,null,null,null,null,null,null,null,null,null,null,null,null,null,null,null,null,null,null,null,null,null,null,null,null,null,null,null,null,null,null,null,null,null,null,null,null,null,null,null,null,null,null,null,null,null,null,null,null,null,"LB552KCI533N3","LB552K","6 1/2X14 HAM'D S-PHO BRONZE SN","LB552K","C","I",5,3,3,"N",3]
[null,null,null,null,null,null,null,null,null,null,null,null,null,null,null,null,null,null,null,null,null,null,null,null,null,null,null,null,null,null,null,null,null,null,null,null,null,null,null,null,null,null,null,null,null,null,null,null,null,null,null,null,null,null,null,"LB552KCT533N3","LB552KT","6 1/2X14 S-PHO BRONZE SNARE DR","LB552K","C","T",5,3,3,"N",3]
[null,null,null,null,null,null,null,null,null,null,null,null,null,null,null,null,null,null,null,null,null,null,null,null,null,null,null,null,null,null,null,null,null,null,null,null,null,null,null,null,null,null,null,null,null,null,null,null,null,null,null,null,null,null,null,"LB552KCT633N3","LB552KTWM","6 1/2X14 S-PHO BRONZE SNARE DR","LB552K","C","T",6,3,3,"N",3]
[null,null,null,null,null,null,null,null,null,null,null,null,null,null,null,null,null,null,null,null,null,null,null,null,null,null,null,null,null,null,null,null,null,null,null,null,null,null,null,null,null,null,null,null,null,null,null,null,null,null,null,null,null,null,null,"LB552KCI633N3","LB552KWM","6 1/2X14 HAM'D S-PHO BRONZE SN","LB552K","C","I",6,3,3,"N",3]
[null,null,null,null,null,null,null,null,null,null,null,null,null,null,null,null,null,null,null,null,null,null,null,null,null,null,null,null,null,null,null,null,null,null,null,null,null,null,null,null,null,null,null,null,null,null,null,null,null,null,null,null,null,null,null,"LB552CT533N3","LB552T","6.5 X 14 BRONZE W/TUBE LUGS","LB552","C","T",5,3,3,"N",3]
[null,null,null,null,null,null,null,null,null,null,null,null,null,null,null,null,null,null,null,null,null,null,null,null,null,null,null,null,null,null,null,null,null,null,null,null,null,null,null,null,null,null,null,null,null,null,null,null,null,null,null,null,null,null,null,"LB552CT633N3","LB552TWM","6.5 X 14 BRONZE W/TUBE LUGS","LB552","C","T",6,3,3,"N",3]
[null,null,null,null,null,null,null,null,null,null,null,null,null,null,null,null,null,null,null,null,null,null,null,null,null,null,null,null,null,null,null,null,null,null,null,null,null,null,null,null,null,null,null,null,null,null,null,null,null,null,null,null,null,null,null,"LB552CI633N3","LB552WM","6 1/2X14 S-PHO BRONZE SNARE DR","LB552","C","I",6,3,3,"N",3]
[null,null,null,null,null,null,null,null,null,null,null,null,null,null,null,null,null,null,null,null,null,null,null,null,null,null,null,null,null,null,null,null,null,null,null,null,null,null,null,null,null,null,null,null,null,null,null,null,null,null,null,null,null,null,null,"LB553BCI833N3","LB553B","3X13 BLK BEAUTY PICCOLO SNARE","LB553B","C","I",8,3,3,"N",3]
[null,null,null,null,null,null,null,null,null,null,null,null,null,null,null,null,null,null,null,null,null,null,null,null,null,null,null,null,null,null,null,null,null,null,null,null,null,null,null,null,null,null,null,null,null,null,null,null,null,null,null,null,null,null,null,"LB553BKCI833N3","LB553BK","3X13 HMMRD BLK BTY PICCOLO SN","LB553BK","C","I",8,3,3,"N",3]
[null,null,null,null,null,null,null,null,null,null,null,null,null,null,null,null,null,null,null,null,null,null,null,null,null,null,null,null,null,null,null,null,null,null,null,null,null,null,null,null,null,null,null,null,null,null,null,null,null,null,null,null,null,null,null,"LB553BCT833N3","LB553BT","3X13 BLK BTY PICCOLO W/TUBE LG","LB553B","C","T",8,3,3,"N",3]
[null,null,null,null,null,null,null,null,null,null,null,null,null,null,null,null,null,null,null,null,null,null,null,null,null,null,null,null,null,null,null,null,null,null,null,null,null,null,null,null,null,null,null,null,null,null,null,null,null,null,null,null,null,null,null,"LB550CI773N3","LB554","5X14 S-SEN BRONZE SNARE DRUM","LB550","C","I",7,7,3,"N",3]
[null,null,null,null,null,null,null,null,null,null,null,null,null,null,null,null,null,null,null,null,null,null,null,null,null,null,null,null,null,null,null,null,null,null,null,null,null,null,null,null,null,null,null,null,null,null,null,null,null,null,null,null,null,null,null,"LB550KCI773N3","LB554K","5X14 HAM'D S-SEN BRONZE SN DR","LB550K","C","I",7,7,3,"N",3]
[null,null,null,null,null,null,null,null,null,null,null,null,null,null,null,null,null,null,null,null,null,null,null,null,null,null,null,null,null,null,null,null,null,null,null,null,null,null,null,null,null,null,null,null,null,null,null,null,null,null,null,null,null,null,null,"LB550CT773N3","LB554KT","5X14 HM'D SS BZ SN W TUBE LUGS","LB550","C","T",7,7,3,"N",3]
[null,null,null,null,null,null,null,null,null,null,null,null,null,null,null,null,null,null,null,null,null,null,null,null,null,null,null,null,null,null,null,null,null,null,null,null,null,null,null,null,null,null,null,null,null,null,null,null,null,null,null,null,null,null,null,"LB550CT773N3","LB554T","5X14 SS BZ SN DRUM W/TUBE LUGS","LB550","C","T",7,7,3,"N",3]
[null,null,null,null,null,null,null,null,null,null,null,null,null,null,null,null,null,null,null,null,null,null,null,null,null,null,null,null,null,null,null,null,null,null,null,null,null,null,null,null,null,null,null,null,null,null,null,null,null,null,null,null,null,null,null,"LB552CI773N3","LB556","6 1/2X14 S-SEN BRONZE SNARE DR","LB552","C","I",7,7,3,"N",3]
[null,null,null,null,null,null,null,null,null,null,null,null,null,null,null,null,null,null,null,null,null,null,null,null,null,null,null,null,null,null,null,null,null,null,null,null,null,null,null,null,null,null,null,null,null,null,null,null,null,null,null,null,null,null,null,"LB552KCI773N3","LB556K","6 1/2X14 HAM'D S-SEN BRONZE SN","LB552K","C","I",7,7,3,"N",3]
[null,null,null,null,null,null,null,null,null,null,null,null,null,null,null,null,null,null,null,null,null,null,null,null,null,null,null,null,null,null,null,null,null,null,null,null,null,null,null,null,null,null,null,null,null,null,null,null,null,null,null,null,null,null,null,"LB552KCT773N3","LB556KT","6 1/2X14 HAM'D S-S W/TUBE LUGS","LB552K","C","T",7,7,3,"N",3]
[null,null,null,null,null,null,null,null,null,null,null,null,null,null,null,null,null,null,null,null,null,null,null,null,null,null,null,null,null,null,null,null,null,null,null,null,null,null,null,null,null,null,null,null,null,null,null,null,null,null,null,null,null,null,null,"LB552CT773N3","LB556T","6 1/2X14 S-S BZ SN W/TUBE LUGS","LB552","C","T",7,7,3,"N",3]
[null,null,null,null,null,null,null,null,null,null,null,null,null,null,null,null,null,null,null,null,null,null,null,null,null,null,null,null,null,null,null,null,null,null,null,null,null,null,null,null,null,null,null,null,null,null,null,null,null,null,null,null,null,null,null,"LM400CI533N3","LM400","5X14 S-PHONIC METAL SNARE DRUM","LM400","C","I",5,3,3,"N",3]
[null,null,null,null,null,null,null,null,null,null,null,null,null,null,null,null,null,null,null,null,null,null,null,null,null,null,null,null,null,null,null,null,null,null,null,null,null,null,null,null,null,null,null,null,null,null,null,null,null,null,null,null,null,null,null,"LM400KCI533N3","LM400K","5X14 HAM'D S-PHO METAL SN DRUM","LM400K","C","I",5,3,3,"N",3]
[null,null,null,null,null,null,null,null,null,null,null,null,null,null,null,null,null,null,null,null,null,null,null,null,null,null,null,null,null,null,null,null,null,null,null,null,null,null,null,null,null,null,null,null,null,null,null,null,null,null,null,null,null,null,null,"LM400KCT533N3","LM400KT","5X14 S-PHONIC METAL SNARE DRUM","LM400K","C","T",5,3,3,"N",3]
[null,null,null,null,null,null,null,null,null,null,null,null,null,null,null,null,null,null,null,null,null,null,null,null,null,null,null,null,null,null,null,null,null,null,null,null,null,null,null,null,null,null,null,null,null,null,null,null,null,null,null,null,null,null,null,"LM400KCI633N3","LM400KWM","5X14 HAM'D S-PHO METAL SN DRUM","LM400K","C","I",6,3,3,"N",3]
[null,null,null,null,null,null,null,null,null,null,null,null,null,null,null,null,null,null,null,null,null,null,null,null,null,null,null,null,null,null,null,null,null,null,null,null,null,null,null,null,null,null,null,null,null,null,null,null,null,null,null,null,null,null,null,"LM400CT533N3","LM400T","5X14 S-PHONIC SNARE W/TUBE LUG","LM400","C","T",5,3,3,"N",3]
[null,null,null,null,null,null,null,null,null,null,null,null,null,null,null,null,null,null,null,null,null,null,null,null,null,null,null,null,null,null,null,null,null,null,null,null,null,null,null,null,null,null,null,null,null,null,null,null,null,null,null,null,null,null,null,"LM400CT633N3","LM400TWM","5X14 S-PHONIC SNARE W/TUBE LUG","LM400","C","T",6,3,3,"N",3]
[null,null,null,null,null,null,null,null,null,null,null,null,null,null,null,null,null,null,null,null,null,null,null,null,null,null,null,null,null,null,null,null,null,null,null,null,null,null,null,null,null,null,null,null,null,null,null,null,null,null,null,null,null,null,null,"LM400CI633N3","LM400WM","5X14 S-PHONIC METAL SNARE DRUM","LM400","C","I",6,3,3,"N",3]
[null,null,null,null,null,null,null,null,null,null,null,null,null,null,null,null,null,null,null,null,null,null,null,null,null,null,null,null,null,null,null,null,null,null,null,null,null,null,null,null,null,null,null,null,null,null,null,null,null,null,null,null,null,null,null,{"$f":"CONCATENATE(BG81,BH81,BI81,BJ81,BK81,BL81,BM81,BN81)","v":"LM402CI533N3"},"LM402","6 1/2X14 S-PHO METAL SNARE DR","LM402","C","I",5,3,3,"N",3]
[null,null,null,null,null,null,null,null,null,null,null,null,null,null,null,null,null,null,null,null,null,null,null,null,null,null,null,null,null,null,null,null,null,null,null,null,null,null,null,null,null,null,null,null,null,null,null,null,null,null,null,null,null,null,null,"LM402KCI533N3","LM402K","6 1/2X14 HAM'D S-P METAL SN DR","LM402K","C","I",5,3,3,"N",3]
[null,null,null,null,null,null,null,null,null,null,null,null,null,null,null,null,null,null,null,null,null,null,null,null,null,null,null,null,null,null,null,null,null,null,null,null,null,null,null,null,null,null,null,null,null,null,null,null,null,null,null,null,null,null,null,"LM402KCT533N3","LM402KT","6.5X14 HMMD CHRM SNRE-TUBE LUG","LM402K","C","T",5,3,3,"N",3]
[null,null,null,null,null,null,null,null,null,null,null,null,null,null,null,null,null,null,null,null,null,null,null,null,null,null,null,null,null,null,null,null,null,null,null,null,null,null,null,null,null,null,null,null,null,null,null,null,null,null,null,null,null,null,null,"LM402KCT633N3","LM402KTDMWM","6 1/2X14 S-PHO METAL SNARE DR","LM402K","C","T",6,3,3,"N",3]
[null,null,null,null,null,null,null,null,null,null,null,null,null,null,null,null,null,null,null,null,null,null,null,null,null,null,null,null,null,null,null,null,null,null,null,null,null,null,null,null,null,null,null,null,null,null,null,null,null,null,null,null,null,null,null,"LM402KCT633N3","LM402KTWM","6.5X14 HMMD CHRM SNRE-TUBE LUG","LM402K","C","T",6,3,3,"N",3]
[null,null,null,null,null,null,null,null,null,null,null,null,null,null,null,null,null,null,null,null,null,null,null,null,null,null,null,null,null,null,null,null,null,null,null,null,null,null,null,null,null,null,null,null,null,null,null,null,null,null,null,null,null,null,null,"LM402CT533N3","LM402T","6 1/2X14 S-PHO METAL SNARE DR","LM402","C","T",5,3,3,"N",3]
[null,null,null,null,null,null,null,null,null,null,null,null,null,null,null,null,null,null,null,null,null,null,null,null,null,null,null,null,null,null,null,null,null,null,null,null,null,null,null,null,null,null,null,null,null,null,null,null,null,null,null,null,null,null,null,"LM402CT633N3","LM402TWM","6 1/2X14 S-PHO METAL SNARE DR","LM402","C","T",6,3,3,"N",3]
[null,null,null,null,null,null,null,null,null,null,null,null,null,null,null,null,null,null,null,null,null,null,null,null,null,null,null,null,null,null,null,null,null,null,null,null,null,null,null,null,null,null,null,null,null,null,null,null,null,null,null,null,null,null,null,"LM402CI633N3","LM402WM","6 1/2X14 S-PHO METAL SNARE DR","LM402","C","I",6,3,3,"N",3]
[null,null,null,null,null,null,null,null,null,null,null,null,null,null,null,null,null,null,null,null,null,null,null,null,null,null,null,null,null,null,null,null,null,null,null,null,null,null,null,null,null,null,null,null,null,null,null,null,null,null,null,null,null,null,null,"LM400CI773N3","LM410","5X14 S-SENS METAL SNARE DRUM","LM400","C","I",7,7,3,"N",3]
[null,null,null,null,null,null,null,null,null,null,null,null,null,null,null,null,null,null,null,null,null,null,null,null,null,null,null,null,null,null,null,null,null,null,null,null,null,null,null,null,null,null,null,null,null,null,null,null,null,null,null,null,null,null,null,"LM400KCI773N3","LM410K","5X14 HAM'D S-S METAL SNARE DR","LM400K","C","I",7,7,3,"N",3]
[null,null,null,null,null,null,null,null,null,null,null,null,null,null,null,null,null,null,null,null,null,null,null,null,null,null,null,null,null,null,null,null,null,null,null,null,null,null,null,null,null,null,null,null,null,null,null,null,null,null,null,null,null,null,null,"LM400KCT773N3","LM410KT","5X14 HAM'D S-S SNR W/TUBE LUGS","LM400K","C","T",7,7,3,"N",3]
[null,null,null,null,null,null,null,null,null,null,null,null,null,null,null,null,null,null,null,null,null,null,null,null,null,null,null,null,null,null,null,null,null,null,null,null,null,null,null,null,null,null,null,null,null,null,null,null,null,null,null,null,null,null,null,"LM400CT773N3","LM410T","5X14 S-S SNR DRUM W/TUBE LUGS","LM400","C","T",7,7,3,"N",3]
[null,null,null,null,null,null,null,null,null,null,null,null,null,null,null,null,null,null,null,null,null,null,null,null,null,null,null,null,null,null,null,null,null,null,null,null,null,null,null,null,null,null,null,null,null,null,null,null,null,null,null,null,null,null,null,"LM402CI773N3","LM411","6 1/2X14 S- SEN METAL SNARE DR","LM402","C","I",7,7,3,"N",3]
[null,null,null,null,null,null,null,null,null,null,null,null,null,null,null,null,null,null,null,null,null,null,null,null,null,null,null,null,null,null,null,null,null,null,null,null,null,null,null,null,null,null,null,null,null,null,null,null,null,null,null,null,null,null,null,"LM402KCI773N3","LM411K","6 1/2X14 HAM'D S-S METAL SN DR","LM402K","C","I",7,7,3,"N",3]
[null,null,null,null,null,null,null,null,null,null,null,null,null,null,null,null,null,null,null,null,null,null,null,null,null,null,null,null,null,null,null,null,null,null,null,null,null,null,null,null,null,null,null,null,null,null,null,null,null,null,null,null,null,null,null,"LM402KCT773N3","LM411KT","6 1/2X14 HAM'D S-S W/TUBE LUGS","LM402K","C","T",7,7,3,"N",3]
[null,null,null,null,null,null,null,null,null,null,null,null,null,null,null,null,null,null,null,null,null,null,null,null,null,null,null,null,null,null,null,null,null,null,null,null,null,null,null,null,null,null,null,null,null,null,null,null,null,null,null,null,null,null,null,"LM402CT773N3","LM411T","6 1/2X14 S- SEN METAL SNARE DR","LM402","C","T",7,7,3,"N",3]

{"sheet":"Legacy","index":3,"n_rows":221,"n_cols":143,"rows_kept":221,"cut":false,"hidden":false,"merged":[[0,10,0,13],[0,15,0,16],[56,0,64,0],[40,137,40,140],[2,136,2,140],[5,137,5,140],[17,136,17,140],[30,137,30,140],[37,136,37,140],[20,137,20,140],[27,136,27,140],[78,49,78,51],[2,0,21,0],[22,0,31,0],[32,0,55,0],[823,15,826,19]]}
[null,"Legacy Order Guide  16",null,null,null,"For best results, enable macros.",null,null,null,"Dealer",null,null,null,null,"PO",null,null,null,null,null,null,null,null,null,null,null,null,null,null,null,null,null,null,null,null,null,null,null,null,null,null,null,null,null,null,null,null,null,null,null,null,null,null,null,null,null,null,null,null,null,null,null,null,null,null,null,null,null,null,"Option Pricing",null,"Finish",null,"Holder,","Spurs","Shell","Screws",null,null,null,"Total",null,"Safeguards",null,null,"Safeguards",null,null,"Safeguards",null,null,"Safeguards",null,null,"Safeguards",null,null,"Safeguards",null,null,"Safeguards",null,null,null,null,"Codification",null,null,null,null,null,null,null,null,null,null,null,null,null,null,null,null,null,null,null,null,null,null,null,null,null,null,null,null,null,null,"Output (print area)"]
[null,null,"Drum Size ","Retail",null,"Finish",null,{"$f":"IF(AU68+AR69+AU71>0,\"BD Hoop Accent\",\"Bass Hoop Inlay\")","v":"Bass Hoop Inlay"},null,null,null,"Mini","Large","Long","Small","Large",null,null,null,null,null,null,null,null,null,null,null,null,null,null,null,null,null,null,null,"IF",null,null,null,null,"Selected","Is num","Qty","Drum Size","Classic","Exotic","Selected",null,"Finish","BTF upcharge","SD Upcharge",null,null,"Hoop Inlay",null,null,"Mini","Large","Long","Small","Large",null,null,null,null,null,null,null,null,"BTF Finish","SD Finish","Upcharge","lugs","legs, brkt","Tone Cntr","Mount","& Claws","Brass","Badge","Hoops","Options",null,null,null,null,null,null,null,null,null,null,null,null,null,null,null,null,null,null,null,null,null,null,null,null,null,null,"Series","Size","Holder","Finish","lugs","Cstm","Conc","iserror","Final",null,null,null,null,null,"New Location",null,"Option","Upcharge","Where Used",null,null,null,null,null,null,null,null,null,null,{"$f":"IF(AQ67=1,\"Bass Drum\",CONCATENATE(AQ67,\" Bass Drums Chosen\"))","v":"0 Bass Drums Chosen"},"Check Main Page for Errors",null,"Order Total",{"$f":"D67","v":0},null,"."]
[{"$f":"IF(AZ69=1,\"L X B D C U S T O M\",\"L C B D C U S T O M\")","v":"L C B D C U S T O M"},null,"12x18 Bass Drum",{"$f":"IF($AZ$69=1,AQ3*(AT3+CC3),AQ3*(AS3+CC3))","v":0},null,null,"0G Black Cortex",null,null,null,"Lugs","Classic","Classic","(Mach)","Twin","Twin","Tube",null,null,null,null,null,null,null,null,null,null,null,null,null,null,null,null,null,null,{"$f":"IF(AQ3>0,CONCATENATE(\"qty \",AQ3,\") \",AR3,\"   \"),\"\")","v":""},null,null,null,"bd",{"$f":"IF(B3=\"\",0,1)","v":0},{"$f":"ISNUMBER(B3)","v":false},{"$f":"IF(AP3=TRUE,B3,AO3)","v":0},"12x18",2265,{"$f":"+AS3+200","v":2465},{"$f":"IF(F3=\"\",0,1)","v":0},null,"0G Black Cortex",0,0,null,{"$f":"IF(H3=\"\",0,1)","v":0},"0G Black Cortex",null,null,"Classic","Classic","(Mach)","Twin","Twin","Tube","Selected","upcharge",null,null,null,null,null,{"$f":"AU3*AX3","v":0},{"$f":"AU3*AY3","v":0},{"$f":"+$BR$60","v":0},{"$f":"+$BL$5","v":0},{"$f":"+$BF$33","v":0},{"$f":"+$BM$17","v":0},{"$f":"+$BA$66","v":0},{"$f":"+$BE$12+$BI$13","v":0},{"$f":"IF($BD$16=1,$DU$10,0)","v":0},{"$f":"$AY$86","v":0},{"$f":"$AX$77","v":0},{"$f":"SUM(BT3:CB3)","v":0},null,"Tom Holder vs Tom Bracket",null,null,"Brass vs. Everything",null,null,"Matching Bass Hoops",null,null,"Size vs. Lugs",null,null,"Size vs. Vibrabands",null,null,"Size vs. Hoops",null,null,"Size (Dia) vs. Spurs",null,null,null,{"$f":"+AO3","v":0},"12x18","28",{"$f":"IF($AZ$69=1,CONCATENATE(\"LLB4\",DC3),CONCATENATE(\"LLB3\",DC3))","v":"LLB328"},{"$f":"VLOOKUP(1,DA3:DD3,4,FALSE)","v":{"$error":"#N/A"}},{"$f":"VLOOKUP(1,$BD$20:$BH$32,5,FALSE)","v":{"$error":"#N/A"}},{"$f":"LEFT(VLOOKUP(1,$AU$3:$AW$54,3,FALSE),2)","v":{"$error":"#N/A"}},{"$f":"IF($BE$5=1,\"\",VLOOKUP(1,$DD$73:$DE$74,2,FALSE))","v":{"$error":"#N/A"}},{"$f":"IF($BD$16=1,\"B Cstm  \",\" Cstm  \")","v":" Cstm  "},{"$f":"CONCATENATE(DE3,DF3,DG3,DH3,DI3)","v":{"$error":"#N/A"}},{"$f":"ISERROR(DJ3)","v":true},{"$f":"IF(DK3=FALSE,DJ3,\"\")","v":""},null,null,null,null,null,"DT3",null,"Large Classic Lugs (Bass, Tom, Floor)",30,"BL5, BL6, BL7",null,null,null,null,null,null,null,null,null,null,{"$f":"+DM22","v":""},null,null,null,null,null,"."]
[null,null,"14x18 Bass Drum",0,null,null,"BG Black Galaxy",null,null,"Lug Error","Snare",null,null,null,null,null,null,null,null,null,null,null,null,null,null,null,null,null,null,null,null,null,null,null,null,"",null,null,null,"bd",0,false,0,"14x18",2265,2465,{"$f":"IF(F4=\"\",0,1)","v":0},null,"BG Black Galaxy",0,0,null,{"$f":"IF(H4=\"\",0,1)","v":0},"BG Black Galaxy",null,"Snare",{"$f":"IF(L4=\"\",0,1)","v":0},null,null,{"$f":"IF(O4=\"\",0,1)","v":0},{"$f":"IF(P4=\"\",0,1)","v":0},{"$f":"IF(Q4=\"\",0,1)","v":0},{"$f":"SUM(BE4:BJ4)","v":0},{"$f":"(BJ4*DU5)+(BE4*DU6)","v":0},null,null,null,null,null,0,{"$f":"AU4*AY4","v":0},0,{"$f":"+$BL$5","v":0},0,0,0,{"$f":"+$BE$12+$BI$13","v":0},0,0,0,{"$f":"SUM(BT4:CB4)","v":0},null,null,null,null,"Anti-Brass Sizes",null,null,{"$f":"+AU3+AU25","v":0},"Black or White Cortex",null,null,null,null,null,null,null,null,null,null,{"$f":"+AO3","v":0},"12x18",null,null,0,"14x18",48,"LLB348",{"$error":"#N/A"},{"$error":"#N/A"},{"$f":"LEFT(VLOOKUP(1,$AU$3:$AW$54,3,FALSE),2)","v":{"$error":"#N/A"}},{"$error":"#N/A"}," Cstm  ",{"$error":"#N/A"},{"$f":"ISERROR(DJ4)","v":true},{"$f":"IF(DK4=FALSE,DJ4,\"\")","v":""},null,null,null,null,null,"DT4",null,"Long Lugs (Bass, Tom, Floor)",40,"BL5, BL6, BL7",null,null,null,null,null,null,null,null,null,null,"Shell Type",{"$f":"IF(AZ69=1,\"Legacy Exotic, LXBDCUSTOM\",\"Legacy Classic, LCBDCUSTOM\")","v":"Legacy Classic, LCBDCUSTOM"},null,"Total Bass Drums",{"$f":"SUM(D3:D22)","v":0},null,"."]
[null,null,"16x18 Bass Drum",0,null,null,"0Q Black Oyster Pearl",null,null,"Lug Error","Bass",null,null,null,null,null,null,null,null,null,null,null,null,null,null,null,null,null,null,null,null,null,null,null,null,"",null,null,null,"bd",0,false,0,"16x18",2265,2465,0,null,"0Q Black Oyster Pearl",0,0,null,0,"0Q Black Oyster Pearl",null,"Bass",{"$f":"IF(L5=\"\",0,1)","v":0},{"$f":"IF(M5=\"\",0,1)","v":0},0,null,null,null,{"$f":"SUM(BE5:BJ5)","v":0},{"$f":"(BF5*DU3)+(BG5*DU4)","v":0},null,null,null,null,null,0,0,0,0,0,0,0,{"$f":"+$BE$12+$BI$13","v":0},0,0,0,0,null,"10.5 mm Tom holder",null,null,{"$f":"+AO3","v":0},"12x18",null,{"$f":"SUM(AU38:AU39)","v":0},"Lacquers",null,"Size vs Mini Classic",null,null,null,"tom bracket",null,{"$f":"+BI42","v":0},"PDC (snares only)",null,0,"14x18",null,null,0,"16x18",68,"LLB368",{"$error":"#N/A"},{"$error":"#N/A"},{"$f":"LEFT(VLOOKUP(1,$AU$3:$AW$54,3,FALSE),2)","v":{"$error":"#N/A"}},{"$error":"#N/A"}," Cstm  ",{"$error":"#N/A"},{"$f":"ISERROR(DJ5)","v":true},{"$f":"IF(DK5=FALSE,DJ5,\"\")","v":""},null,null,null,null,null,"DT5",null,"Tube Lugs (Snare)",45,"BL4",null,null,null,null,null,null,null,null,null,null,"Drum Type","Bass Drum",null,null,null,null,"."]
[null,null,"12x20 Bass Drum",0,null,null,"0R Black Sparkle",null,null,null,"Floor",null,null,null,null,null,null,null,null,null,null,null,null,null,null,null,null,null,null,null,null,null,null,null,null,"",null,null,null,"bd",0,false,0,"12x20",2285,2485,0,null,"0R Black Sparkle",0,0,null,0,"0R Black Sparkle",null,"Floor",{"$f":"IF(L6=\"\",0,1)","v":0},0,0,null,null,null,{"$f":"SUM(BE6:BJ6)","v":0},{"$f":"(BF6*DU3)+(BG6*DU4)","v":0},null,null,null,null,null,0,0,0,0,0,0,0,0,0,0,0,0,null,{"$f":"+BD22","v":0},"LR2991MT Elite Single Tom Holder",null,0,"14x18",null,{"$f":"SUM(AU31:AU37)","v":0},"Exotics",null,{"$f":"+BE4","v":0},"Mini lugs (SD)",null,{"$f":"+BL25","v":0},"L_RL Vibraband w/ Ludwig Brkt",null,null,null,null,0,"16x18",null,null,0,"12x20","20","LLB320",{"$error":"#N/A"},{"$error":"#N/A"},{"$f":"LEFT(VLOOKUP(1,$AU$3:$AW$54,3,FALSE),2)","v":{"$error":"#N/A"}},{"$error":"#N/A"}," Cstm  ",{"$error":"#N/A"},true,"",null,null,null,null,null,"DT6",null,"Mini Classic Lugs (Snare)",0,"BL4",null,null,null,null,null,null,null,null,null,null,"Size",{"$f":"AJ72","v":""},null,null,null,null,"."]
[null,null,"14x20 Bass Drum",0,null,null,"32 Blue Sparkle",null,null,"Lug Error","Tom",null,null,null,null,null,null,null,null,null,null,null,null,null,null,null,null,null,null,null,null,null,null,null,null,"",null,null,null,"bd",{"$f":"IF(B7=\"\",0,1)","v":0},{"$f":"ISNUMBER(B7)","v":false},{"$f":"IF(AP7=TRUE,B7,AO7)","v":0},"14x20",2285,2485,0,null,"32 Blue Sparkle",0,0,null,0,"32 Blue Sparkle",null,"Tom",{"$f":"IF(L7=\"\",0,1)","v":0},0,0,null,null,null,{"$f":"SUM(BE7:BJ7)","v":0},{"$f":"(BF7*DU3)+(BG7*DU4)","v":0},null,null,null,null,null,0,0,0,0,0,0,0,0,0,0,0,0,null,{"$f":"+BD23","v":0},"LR2992MT Classic Double",null,0,"16x18",null,null,null,null,null,null,null,{"$f":"+BL27","v":0},"L_RK Vibraband w/ Keystone Bracket",null,{"$f":"+AO57","v":0},"6x12",null,{"$f":"+AO6+AO7","v":0},"12x20 & 14x20",null,null,{"$f":"+AO7","v":0},"14x20",40,"LLB340",{"$error":"#N/A"},{"$error":"#N/A"},{"$f":"LEFT(VLOOKUP(1,$AU$3:$AW$54,3,FALSE),2)","v":{"$error":"#N/A"}},{"$error":"#N/A"}," Cstm  ",{"$error":"#N/A"},true,"",null,null,null,null,null,null,null,null,null,null,null,null,null,null,null,null,null,null,null,null,"Finish",{"$f":"VLOOKUP(1,AU3:AW54,3,FALSE)","v":{"$error":"#N/A"}},null,"Left Front Placement",{"$f":"IF(AZ62=1,\"There\",\"Not There\")","v":"Not There"},null,"."]
[null,null,"16x20 Bass Drum",0,null,null,"0C Champagne Sparkle",null,null,null,null,null,null,null,null,null,null,null,null,null,null,null,null,null,null,null,null,null,null,null,null,null,null,null,null,"",null,null,null,"bd",0,false,0,"16x20",2285,2485,0,null,"0C Champagne Sparkle",200,200,null,0,"0C Champagne Sparkle",null,null,"ML Mini Classic","CL Large Classic","LL Long Lugs","ST Small Twin","LT Large Twin","TB Tube",null,null,null,null,null,null,null,0,0,0,0,0,0,0,0,0,0,0,0,null,{"$f":"+BD32","v":0},"LR2993MT Rail Consolette 10.5mm",null,{"$f":"+AO6+AO7","v":0},"12x20 & 14x20",null,null,null,null,{"$f":"+AO58","v":0},"3Hx13",null,{"$f":"SUM(CQ6:CQ7)","v":0},"sum of conflict brkts",null,{"$f":"+AO58","v":0},"3Hx13",null,{"$f":"+AO8","v":0},"16x20",null,null,0,"16x20",60,"LLB360",{"$error":"#N/A"},{"$error":"#N/A"},{"$f":"LEFT(VLOOKUP(1,$AU$3:$AW$54,3,FALSE),2)","v":{"$error":"#N/A"}},{"$error":"#N/A"}," Cstm  ",{"$error":"#N/A"},true,"",null,null,null,null,null,"DT8",null,"Bass Drum T handles",40,"BE11",null,null,null,null,null,null,null,null,null,null,"Bass Hoops",{"$f":"VLOOKUP(1,AU62:AW76,3,FALSE)","v":{"$error":"#N/A"}},null,"Right Front Placement",{"$f":"IF(AZ63=1,\"There\",\"Not There\")","v":"Not There"},null,"."]
[null,null,"18x20 Bass Drum",0,null,null,"35 Customer Supply",null,null,null,"Bass Screws",null,"Rod/Claw Conflict",null,"Bass Claws",null,null,null,null,null,null,null,null,null,null,null,null,null,null,null,null,null,null,null,null,"",null,null,null,"bd",0,false,0,"18x20",2285,2485,0,null,"35 Customer Supply",0,0,null,0,"35 Customer Supply",null,"Bass Screws",null,null,null,"Bass Claws",null,null,null,null,null,null,null,null,null,0,0,0,0,0,0,0,0,{"$f":"IF($BD$16=1,$DU$10,0)","v":0},0,0,0,null,{"$f":"SUM(CE6:CE8)","v":0},"returns a 1 if 10.5mm tom holder",null,{"$f":"+AO8","v":0},"16x20",null,null,null,null,{"$f":"+AO60","v":0},"3Hx14",null,null,null,null,{"$f":"+AO59","v":0},"6x13",null,{"$f":"+AO9","v":0},"18x20",null,null,0,"18x20",80,"LLB380",{"$f":"VLOOKUP(1,DA9:DD9,4,FALSE)","v":{"$error":"#N/A"}},{"$error":"#N/A"},{"$error":"#N/A"},{"$error":"#N/A"}," Cstm  ",{"$error":"#N/A"},true,"",null,null,null,null,null,null,null,"P2306 Die Cast",20,null,null,null,null,null,null,null,null,null,null,null,"Accent Color",{"$f":"IFERROR(VLOOKUP(1,BA3:BB40,2,FALSE),\"\")","v":""},null,"Left Back Placement",{"$f":"IF(AZ64=1,\"There\",\"Not There\")","v":"Not There"},null,"."]
[null,null,"12x22 Bass Drum",0,null,null,"33 Gold Sparkle",null,null,null,null,"K Keyrods",null,null,null,"P2306 Die Cast",null,null,null,null,null,null,null,null,null,null,null,null,null,null,null,null,null,null,null,{"$f":"IF(AQ10>0,CONCATENATE(\"qty \",AQ10,\") \",AR10,\"   \"),\"\")","v":""},null,null,null,"bd",0,false,0,"12x22",2295,2495,0,null,"33 Gold Sparkle",0,0,null,0,"33 Gold Sparkle",null,{"$f":"IF(K10=\"\",0,1)","v":0},{"$f":"+BD10*0","v":0},"K Keyrods",null,{"$f":"IF(O10=\"\",0,1)","v":0},{"$f":"+BH10*DU9","v":0},"P2306 Die Cast",null,"Selected","Upcharge","Bass Spurs",null,null,null,0,0,0,0,0,0,0,0,0,0,0,0,null,null,null,null,{"$f":"+AO9","v":0},"18x20",null,null,null,null,{"$f":"+AO61","v":0},"5x14",null,{"$f":"+AO33","v":0},"8x6",null,{"$f":"SUM(CT7:CT9)","v":0},"Sum of conflict sizes",null,{"$f":"SUM(CW4:CW9)","v":0},"Sum of Conflict Sizes",null,null,0,"12x22","22","LLB322",{"$f":"VLOOKUP(1,DA10:DD10,4,FALSE)","v":{"$error":"#N/A"}},{"$error":"#N/A"},{"$error":"#N/A"},{"$error":"#N/A"}," Cstm  ",{"$f":"CONCATENATE(DE10,DF10,DG10,DH10,DI10)","v":{"$error":"#N/A"}},{"$f":"ISERROR(DJ10)","v":true},"",null,null,null,null,null,"DT10",null,"Brass Hardware (Bass, Tom, Floor)",60,"BZ3-BZ51",null,null,null,null,null,null,null,null,null,null,"Lugs",{"$f":"HLOOKUP(1,BE5:BG8,4,FALSE)","v":{"$error":"#N/A"}},null,"Right Back Placement",{"$f":"IF(AZ65=1,\"There\",\"Not There\")","v":"Not There"},null,"."]
[null,null,"14x22 Bass Drum",0,null,null,"54 Green Sparkle",null,null,null,null,"T \"T\"-Handles",null,null,null,"P2308 New Classic",null,null,null,null,null,null,null,null,null,null,null,null,null,null,null,null,null,null,null,"",null,null,null,"bd",0,false,0,"14x22",2295,2495,0,null,"54 Green Sparkle",0,0,null,0,"54 Green Sparkle",null,{"$f":"IF(K11=\"\",0,1)","v":0},{"$f":"+BD11*DU8","v":0},"T \"T\"-Handles",null,{"$f":"IF(O11=\"\",0,1)","v":0},null,"P2308 New Classic",null,{"$f":"IF(P15=\"\",0,1)","v":0},{"$f":"+BL11*0","v":0},"LR2974SP Elite Kick Spur",null,null,null,0,0,0,0,0,0,0,0,0,0,0,0,null,"Tom brackets that won't work with 10.5mm",null,null,{"$f":"+AO23","v":0},"12x14",null,null,null,null,{"$f":"+AO64","v":0},"5x14 8 Lug",null,{"$f":"+AO50","v":0},"12x15",null,null,null,null,null,null,null,null,0,"14x22",42,"LLB342",{"$error":"#N/A"},{"$error":"#N/A"},{"$error":"#N/A"},{"$error":"#N/A"}," Cstm  ",{"$error":"#N/A"},true,"",null,null,null,null,null,"DT11",null,"Brass Hardwaer (Snare)",60,"BZ52-BZ60",null,null,null,null,null,null,null,null,null,null,"Hardware Finish",{"$f":"VLOOKUP(1,BD15:BF16,3,FALSE)","v":{"$error":"#N/A"}},null,"Clawhooks",{"$f":"VLOOKUP(1,BH10:BJ12,3,FALSE)","v":{"$error":"#N/A"}},null,"."]
[null,null,"16x22 Bass Drum",0,null,null,"JW Jumbo White",null,null,null,null,null,null,null,null,"PM0045 Keystone",null,null,null,null,null,null,null,null,null,null,null,null,null,null,null,null,null,null,null,"",null,null,null,"bd",0,false,0,"16x22",2295,2495,0,null,"JW Jumbo White",0,0,null,0,"JW Jumbo White","Selected",{"$f":"SUM(BD10:BD11)","v":0},{"$f":"SUM(BE10:BE11)","v":0},"Upcharge",null,{"$f":"IF(O12=\"\",0,1)","v":0},null,"PM0045 Keystone",null,0,{"$f":"+BL12*0","v":0},"LR2973SP Rocker Rotating Spur",null,null,null,0,0,0,0,0,0,0,0,0,0,0,0,null,{"$f":"+BL24","v":0},"P1216D Classic Ludwig Bracket ",null,{"$f":"+AO24","v":0},"13x14",null,null,null,null,{"$f":"SUM(CN8:CN11)","v":0},"Sum of Conflict sizes",null,{"$f":"+AO51","v":0},"13x15",null,{"$f":"+CT10*CT5","v":0},"Error if > 0",null,{"$f":"+BL13","v":0},"LC1308SP Curved Spur",null,null,0,"16x22",62,"LLB362",{"$error":"#N/A"},{"$error":"#N/A"},{"$error":"#N/A"},{"$error":"#N/A"}," Cstm  ",{"$error":"#N/A"},true,"",null,null,null,null,null,null,null,null,null,null,null,null,null,null,null,null,null,null,null,null,"Tom Holder",{"$f":"VLOOKUP(1,BD20:BG32,4,FALSE)","v":{"$error":"#N/A"}},null,"Tension Screws",{"$f":"VLOOKUP(1,BD10:BF11,3,FALSE)","v":{"$error":"#N/A"}},null,"."]
[null,null,"18x22 Bass Drum",0,null,null,"36 Olive Sparkle",null,null,"PLATING CONFLICT",null,null,null,null,null,"Size / Spur Conflict",null,null,null,null,null,null,null,null,null,null,null,null,null,null,null,null,null,null,null,"",null,null,null,"bd",0,false,0,"18x22",2295,2495,0,null,"36 Olive Sparkle",0,0,null,0,"36 Olive Sparkle",null,null,null,null,null,{"$f":"SUM(BH10:BH12)","v":0},{"$f":"SUM(BI10:BI12)","v":0},"Upcharge",null,0,{"$f":"+BL13*DU13","v":0},"LC1308SP Curved Spur",null,null,null,0,0,0,0,0,0,0,0,0,0,0,0,null,{"$f":"+BL25","v":0},"L_RL Vibraband w/ Ludwig Brkt",null,{"$f":"+AO25","v":0},"14x14",null,null,null,null,{"$f":"+CN12*CN6","v":0},"Error if > 0",null,{"$f":"+AO52","v":0},"14x15",null,null,null,null,{"$f":"+BL14","v":0},"LC1308SP2 2 Pr. Curved Spurs",null,null,0,"18x22",82,"LLB382",{"$error":"#N/A"},{"$error":"#N/A"},{"$error":"#N/A"},{"$error":"#N/A"}," Cstm  ",{"$error":"#N/A"},true,"",null,null,null,null,null,null,null,"Curved Spurs",30,null,null,null,null,null,null,null,null,null,null,null,"Right or Left Handed",{"$f":"IFERROR(VLOOKUP(1,BD34:BG35,4,FALSE),\"\")","v":""},null,"Batter Head",{"$f":"VLOOKUP(1,BD56:BE56,2,FALSE)","v":"PS3 Clear"},null,"."]
[null,null,"20x22 Bass Drum",0,null,null,"RP Red Oyster",null,null,"Hardware Finish",null,null,null,null,null,"Bass Spurs",null,null,null,null,null,null,null,null,null,null,null,null,null,null,null,null,null,null,null,"",null,null,null,"bd",0,false,0,"20x22",2295,2495,0,null,"RP Red Oyster",0,0,null,0,"RP Red Oyster",null,"Hardware Finish",null,null,null,null,null,null,null,0,{"$f":"+BL14*DU14","v":0},"LC1308SP2 2 Pr. Curved Spurs",null,null,null,0,0,0,0,0,0,0,0,0,0,0,0,null,{"$f":"+BL28","v":0},"P1762B Modular Tom Bracket",null,{"$f":"+AO26","v":0},"13x15",null,null,null,null,null,null,null,{"$f":"SUM(CQ10:CQ13)","v":0},"sum of conflict sizes",null,null,null,null,{"$f":"SUM(CW12:CW13)","v":0},"Sum of Conflict Spurs",null,null,0,"20x22","02","LLB302",{"$error":"#N/A"},{"$error":"#N/A"},{"$error":"#N/A"},{"$error":"#N/A"}," Cstm  ",{"$error":"#N/A"},true,"",null,null,null,null,null,"DT13",null,"2 pr Curved Spurs",60,"BM14",null,null,null,null,null,null,null,null,null,null,"Spurs",{"$f":"VLOOKUP(1,BL11:BN16,3,FALSE)","v":{"$error":"#N/A"}},null,"Resonant Head",{"$f":"VLOOKUP(1,BI56:BJ58,2,FALSE)","v":{"$error":"#N/A"}},null,"."]
[null,null,"12x24 Bass Drum",0,null,null,"27 Red Sparkle",null,null,null,"Chrome",null,null,null,null,null,"LR2974SP Elite Kick Spur",null,null,null,null,null,null,null,null,null,null,null,null,null,null,null,null,null,null,{"$f":"IF(AQ15>0,CONCATENATE(\"qty \",AQ15,\") \",AR15,\"   \"),\"\")","v":""},null,null,null,"bd",0,false,0,"12x24",2430,2630,0,null,"27 Red Sparkle",0,0,null,0,"27 Red Sparkle",null,{"$f":"IF(J15=\"\",0,1)","v":0},null,"Chrome",null,"Tom Heads",null,null,null,0,{"$f":"BL15*DU15","v":0},"NSP No Spurs or Drilling",null,null,null,0,0,0,0,0,0,0,0,0,0,0,0,null,{"$f":"SUM(CE12:CE14)","v":0},"returns a 1 if <> 10.5mm",null,{"$f":"+AO27","v":0},"14x15",null,null,null,null,"Size vs. Lg Classic lugs.",null,null,null,null,null,null,null,null,null,null,null,null,0,"12x24","24","LLB324",{"$f":"VLOOKUP(1,DA15:DD15,4,FALSE)","v":{"$error":"#N/A"}},{"$error":"#N/A"},{"$error":"#N/A"},{"$error":"#N/A"}," Cstm  ",{"$f":"CONCATENATE(DE15,DF15,DG15,DH15,DI15)","v":{"$error":"#N/A"}},{"$f":"ISERROR(DJ15)","v":true},{"$f":"IF(DK15=FALSE,DJ15,\"\")","v":""},null,null,null,null,null,"DT14",null,"No Spurs or Drilling",0,"BM15",null,null,null,null,null,null,null,null,null,null,"Shell Mount",{"$f":"VLOOKUP(1,AZ59:BB61,3,FALSE)","v":{"$error":"#N/A"}},null,"Badge",{"$f":"VLOOKUP(1,AX80:AZ83,3,FALSE)","v":{"$error":"#N/A"}},null,"."]
[null,null,"14x24 Bass Drum",0,null,null,"SP ShamPayne",null,null,null,"Brass","(Bass Drum has Chrome Tom Holder)",null,null,null,null,"LR2973SP Rocker Rotating Spur",null,null,null,null,null,null,null,null,null,null,null,null,null,null,null,null,null,null,"",null,null,null,"bd",0,false,0,"14x24",2430,2630,0,null,"SP ShamPayne",0,0,null,0,"SP ShamPayne",null,{"$f":"IF(J16=\"\",0,1)","v":0},null,"Brass",null,{"$f":"IF(M15=\"\",0,1)","v":0},"Double (as God intended)",null,null,0,{"$f":"BL16*DU16","v":0},"LAC2973SP Atlas Anchor",null,null,null,0,0,0,0,0,0,0,0,0,0,0,0,null,null,null,null,null,null,null,null,null,null,{"$f":"+BF7","v":0},"Lg Classic Lugs (TT)",null,{"$f":"+CQ14*CQ8","v":0},"Error if >0",null,"Size vs. Finish",null,null,{"$f":"+CW14*CW10","v":0},"Error if > 0",null,null,0,"14x24","44","LLB344",{"$error":"#N/A"},{"$error":"#N/A"},{"$error":"#N/A"},{"$error":"#N/A"}," Cstm  ",{"$error":"#N/A"},true,"",null,null,null,null,null,"DT15",null,"LAC2973SP Atlas Anchor",0,null,null,null,null,null,null,null,null,null,null,null,null,null,null,null,null,null,"."]
[null,null,"16x24 Bass Drum",0,null,null,"1V Silver Glass Glitter",null,null,null,null,null,null,null,null,null,"LC1308SP Curved Spur",null,null,null,null,null,null,null,null,null,null,null,null,null,null,null,null,null,null,"",null,null,null,"bd",0,false,0,"16x24",2430,2630,0,null,"1V Silver Glass Glitter",50,50,null,0,"1V Silver Glass Glitter","Selected",{"$f":"SUM(BD15:BD16)","v":0},null,null,null,{"$f":"IF(M16=\"\",0,1)","v":0},"Single (Hippie rubbish)",null,"Selected",{"$f":"SUM(BL11:BL16)","v":0},{"$f":"SUM(BM11:BM16)","v":0},"Upcharge",null,null,null,0,0,0,0,0,0,0,0,0,0,0,0,null,{"$f":"IF(CE15*CE9>0,1,0)","v":0},"Returns a 1 if error",null,null,null,null,null,null,null,null,null,null,null,null,null,null,"20\" deep bass vs exotics",null,null,null,null,null,0,"16x24","64","LLB364",{"$error":"#N/A"},{"$error":"#N/A"},{"$error":"#N/A"},{"$error":"#N/A"}," Cstm  ",{"$error":"#N/A"},true,"",null,null,null,null,null,null,null,"Tom Holders",null,null,null,null,null,null,null,null,null,null,null,null,{"$f":"IF(AQ69=1,\"Tom Tom\",CONCATENATE(AQ69,\" Tom Toms Chosen\"))","v":"0 Tom Toms Chosen"},"Check Main Page for Errors",null,null,null,null,"."]
[null,null,"18x24 Bass Drum",0,null,null,"0S Silver Sparkle",null,null,null,null,null,null,null,null,null,"LC1308SP2 2 Pr. Curved Spurs",null,null,null,null,null,null,null,null,null,null,null,null,null,null,null,null,null,null,"",null,null,null,"bd",0,false,0,"18x24",2430,2630,0,null,"0S Silver Sparkle",0,0,null,0,"0S Silver Sparkle",null,null,null,null,null,{"$f":"SUM(BH16:BH17)","v":0},"Selected",null,null,null,null,null,null,null,null,0,0,0,0,0,0,0,0,0,0,0,0,null,null,null,null,null,null,null,null,null,null,null,"7x8",null,null,null,null,{"$f":"+AO14","v":0},"20x22",null,null,null,null,null,0,"18x24","84","LLB384",{"$error":"#N/A"},{"$error":"#N/A"},{"$error":"#N/A"},{"$error":"#N/A"}," Cstm  ",{"$error":"#N/A"},true,"",null,null,null,null,null,"DT17",null,"P7184A Elite Bass Casting",25,"BE21",null,null,null,null,null,null,null,null,null,null,{"$f":"+DN56","v":""},null,null,null,null,null,"."]
[null,null,"20x24 Bass Drum",0,null,null,"52 Sky Blue Pearl",null,null,null,"Tom Holder",null,"Holder/Lug Error",null,null,null,"NSP No Spurs or Drilling",null,null,null,null,null,null,null,null,null,null,null,null,null,null,null,null,null,null,"",null,null,null,"bd",0,false,0,"20x24",2430,2630,0,null,"52 Sky Blue Pearl",0,0,null,0,"52 Sky Blue Pearl",null,"Selected","Upcharge",null,"Tom Holder","Codif",null,null,null,null,null,null,null,null,null,0,0,0,0,0,0,0,0,0,0,0,0,null,null,null,null,{"$f":"+AO34","v":0},"7x10",null,"Bass Hoops for Wrap Drums",null,null,{"$f":"+AO34","v":0},"7x10",null,"Size vs Throwoff",null,null,{"$f":"+AO19","v":0},"20x24",null,null,null,null,null,0,"20x24","04","LLB304",{"$error":"#N/A"},{"$error":"#N/A"},{"$error":"#N/A"},{"$error":"#N/A"}," Cstm  ",{"$error":"#N/A"},true,"",null,null,null,null,null,"DT18",null,"LR2991MT Elite Single Tom Holder",95,"BE22",null,null,null,null,null,null,null,null,null,null,"Shell Type",{"$f":"IF(AZ69=1,\"Legacy Exotic, LXTTCUSTOM\",\"Legacy Classic, LCTTCUSTOM\")","v":"Legacy Classic, LCTTCUSTOM"},null,"Total Tom Toms",{"$f":"SUM(D33:D56)","v":0},null,"."]
[null,null,"12x26 Bass Drum",0,null,null,"37 Teal Blue Sparkle",null,null,null,null,"NMT Less Mount and Holder",null,null,null,null,"LAC2973SP Atlas Anchor",null,null,null,null,null,null,null,null,null,null,null,null,null,null,null,null,null,null,{"$f":"IF(AQ20>0,CONCATENATE(\"qty \",AQ20,\") \",AR20,\"   \"),\"\")","v":""},null,null,null,"bd",0,false,0,"12x26",2450,2650,0,null,"37 Teal Blue Sparkle",0,0,null,0,"37 Teal Blue Sparkle",null,{"$f":"IF(K20=\"\",0,1)","v":0},0,{"$f":"+BD20*BE20","v":0},"NMT Less Mount and Holder","XX",null,null,null,null,null,null,null,null,null,0,0,0,0,0,0,0,0,0,0,0,0,null,"9.5mm Tom Holder",null,null,{"$f":"+AO35","v":0},"8x10",null,{"$f":"+AU62","v":0},"STi Satin Black w/Inlay",null,{"$f":"SUM(CN18:CN19)","v":0},"Sum of Conflict Sizes",null,{"$f":"+BH46","v":0},"P85 Supraphonic",null,{"$f":"SUM(CT18:CT19)","v":0},"Sum of Conflict Sizes",null,"Throwoff vs. Butt",null,null,null,0,"12x26","26","LLB326",{"$error":"#N/A"},{"$error":"#N/A"},{"$error":"#N/A"},{"$error":"#N/A"}," Cstm  ",{"$f":"CONCATENATE(DE20,DF20,DG20,DH20,DI20)","v":{"$error":"#N/A"}},{"$f":"ISERROR(DJ20)","v":true},{"$f":"IF(DK20=FALSE,DJ20,\"\")","v":""},null,null,null,null,null,"DT19",null,"LR2992MT Classic Double Tom Holder",100,"BE23",null,null,null,null,null,null,null,null,null,null,"Drum Type","Tom Tom",null,null,null,null,"."]
[null,null,"14x26 Bass Drum",0,null,null,"1Q Vintage Black Oyster",null,null,null,null,{"$f":"IF(BD16=1, \"P7184A CHROME Elite Casting\", \"P7184A Elite Bass Casting\")","v":"P7184A Elite Bass Casting"},null,null,null,"Size vs. Vibraband Conflict",null,null,null,null,null,null,null,null,null,null,null,null,null,null,null,null,null,null,null,"",null,null,null,"bd",0,false,0,"14x26",2450,2650,0,null,"1Q Vintage Black Oyster",50,50,null,0,"1Q Vintage Black Oyster",null,{"$f":"IF(K21=\"\",0,1)","v":0},{"$f":"DU18","v":25},{"$f":"+BD21*BE21","v":0},{"$f":"IF(BD16=1, \"CHROME Elite Casting\",  \"P7184A Elite Bass Casting\")","v":"P7184A Elite Bass Casting"},"EX",null,null,null,null,null,null,null,null,null,0,0,0,0,0,0,0,0,0,0,0,0,null,{"$f":"+BD25","v":0},"LR2981MT Rocker Single Tom Holder",null,{"$f":"+AO36","v":0},"9x10",null,0,"SNi Satin Natural w/Inlay",null,{"$f":"+CN20*CN16","v":0},"Error if > 0",null,{"$f":"+BH47","v":0},"P86 Millennium",null,null,null,null,null,null,null,null,0,"14x26","46","LLB346",{"$error":"#N/A"},{"$error":"#N/A"},{"$error":"#N/A"},{"$error":"#N/A"}," Cstm  ",{"$error":"#N/A"},true,"",null,null,null,null,null,"DT20",null,"P1610D Ludwig Bass Casting ",50,"BE24",null,null,null,null,null,null,null,null,null,null,"Size",{"$f":"AJ74","v":""},null,null,null,null,"."]
[null,null,"16x26 Bass Drum",0,null,null,"2Q Vintage Blue Oyster",null,null,null,null,{"$f":"IF(BD16=1,\"LR2991MT CHROME Elite Single\", \"LR2991MT Elite Single Tom Holder\")","v":"LR2991MT Elite Single Tom Holder"},null,null,"TOM HOLDER / BRACKET CONFLICT",null,null,null,null,null,null,null,null,null,null,null,null,null,null,null,null,null,null,null,null,"",null,null,null,"bd",0,false,0,"16x26",2450,2650,0,null,"2Q Vintage Blue Oyster",0,0,null,0,"2Q Vintage Blue Oyster",null,0,95,{"$f":"+BD22*BE22","v":0},{"$f":"IF(BD16=1, \"CHROME Elite Single\", \"LR2991MT Elite Single Tom Holder\")","v":"LR2991MT Elite Single Tom Holder"},"ES",null,null,null,"Tom Bracket",null,null,null,"Codif",null,0,0,0,0,0,0,0,0,0,0,0,0,null,{"$f":"+BD26","v":0},"LR2980MT Rocker Double Tom Holder",null,{"$f":"+AO45","v":0},"10x14",null,0,"ST Satin Black",null,null,null,null,{"$f":"SUM(CQ20:CQ21)","v":0},"Sum of conflict strainers",null,{"$f":"+AU44","v":0},"50 Birdseye Maple",null,{"$f":"SUM(BH46:BH48)","v":0},"P85/P86/P80",null,null,0,"16x26","66","LLB366",{"$error":"#N/A"},{"$error":"#N/A"},{"$error":"#N/A"},{"$error":"#N/A"}," Cstm  ",{"$error":"#N/A"},true,"",{"$f":"CONCATENATE(DL3,DL4,DL5,DL6,DL7,DL8,DL9,DL10,DL11,DL12,DL13,DL14,DL15,DL16,DL17,DL18,DL19,DL20,DL21,DL22)","v":""},null,null,null,null,"DT21",null,"LR2981MT Rocker Single Tom Holder",95,"BE25",null,null,null,null,null,null,null,null,null,null,"Finish",{"$f":"EH7","v":{"$error":"#N/A"}},null,"Tone Control",{"$f":"VLOOKUP(1,BD38:BF39,3,FALSE)","v":{"$error":"#N/A"}},null,"."]
[{"$f":"IF(AZ69=1,\"L X F T C U S T O M\",\"L C F T C U S T O M\")","v":"L C F T C U S T O M"},null,"12x14 Floor Tom",0,null,null,"NS Vintage Nickel Sparkle",null,null,null,null,{"$f":"IF(BD16=1, \"LR2992MT CHROME Classic Double\", \"LR2992MT Classic Double Tom Holder\")","v":"LR2992MT Classic Double Tom Holder"},null,null,null,"Tom Bracket",null,null,null,null,null,null,null,null,null,null,null,null,null,null,null,null,null,null,null,"",null,null,null,"ft",0,false,0,"12x14",1399,1599,0,null,"NS Vintage Nickel Sparkle",0,0,null,0,"NS Vintage Nickel Sparkle",null,0,100,0,{"$f":"IF(BD16=1, \"CHROME Classic Double\", \"LR2992MT Classic Double Tom Holder\")","v":"LR2992MT Classic Double Tom Holder"},"EH",null,null,null,{"$f":"IF(P24=\"\",0,1)","v":0},{"$f":"+BL23*0","v":0},"NBKT No Mounting Bracket",null,"XX",null,0,0,0,{"$f":"+$BL$6","v":0},{"$f":"+$BM$39","v":0},{"$f":"+$BE$40","v":0},null,null,0,0,null,0,null,{"$f":"+BD31","v":0},"LR2983MT Rail Consolette 9.5mm",null,0,"11x14",null,0,"SN Satin Natural",null,"Size vs. Long Lugs",null,null,null,null,null,{"$f":"+AU53","v":0},"B1  African Bubinga",null,{"$f":"SUM(BN49:BN50)","v":0},"P70/P71",null,null,0,"12x14","24",{"$f":"IF($AZ$69=1,CONCATENATE(\"LLF4\",DC23),CONCATENATE(\"LLF3\",DC23))","v":"LLF324"},{"$error":"#N/A"},{"$f":"VLOOKUP(1,$BL$35:$BP$38,5,FALSE)","v":{"$error":"#N/A"}},{"$error":"#N/A"},{"$f":"IF($BE$6=1,\"\",VLOOKUP(1,$DG$73:$DH$74,2,FALSE))","v":{"$error":"#N/A"}}," Cstm  ",{"$error":"#N/A"},true,{"$f":"IF(DK23=FALSE,DJ23,\"\")","v":""},null,null,null,null,null,"DT22",null,"LR2980MT Rocker Double Tom Holder",120,"BE26",null,null,null,null,null,null,null,null,null,null,"Lugs",{"$f":"HLOOKUP(1,BE7:BG8,2,FALSE)","v":{"$error":"#N/A"}},null,"Batter Head",{"$f":"VLOOKUP(1,BD58:BE60,2,FALSE)","v":{"$error":"#N/A"}},null,"."]
[null,null,"13x14 Floor Tom",0,null,null,"NM Vintage White Marine",null,null,null,null,{"$f":"IF(BD16=1, \"P1610D CHROME Ludwig Casting\", \"P1610D Ludwig Bass Casting\")","v":"P1610D Ludwig Bass Casting"},null,null,null,null,"NBKT No Mounting Bracket",null,null,null,null,null,null,null,null,null,null,null,null,null,null,null,null,null,null,"",null,null,null,"ft",0,false,0,"13x14",1399,1599,0,null,"NM Vintage White Marine",0,0,null,0,"NM Vintage White Marine",null,0,50,0,{"$f":"IF(BD16=1, \"CHROME Ludwig Casting\", \"P1610D Ludwig Bass Casting\")","v":"P1610D Ludwig Bass Casting"},"LX",null,null,null,0,{"$f":"+BL24*DU37","v":0},"P1216D Classic Ludwig Bracket ",null,"LM",null,0,0,0,0,0,0,null,null,0,0,null,0,null,{"$f":"SUM(CE21:CE23)","v":0},"returns a 1 if 9.5mm tom holder",null,0,"12x14",null,0,"0Ti Sable Black w/Matching Inlay",null,{"$f":"+BG7","v":0},"Long Lugs (tt)",null,{"$f":"+AO58","v":0},"3Hx13",null,{"$f":"+AU54","v":0},"FE Fumed Eucalyptus",null,{"$f":"+CW23*CW22","v":0},"Error if > 0",null,null,0,"13x14","34","LLF334",{"$error":"#N/A"},{"$f":"VLOOKUP(1,$BL$35:$BP$38,5,FALSE)","v":{"$error":"#N/A"}},{"$error":"#N/A"},{"$error":"#N/A"}," Cstm  ",{"$error":"#N/A"},true,{"$f":"IF(DK24=FALSE,DJ24,\"\")","v":""},null,null,null,null,null,"DT23",null,"LAC2983MT Atlas Arch Single",150,"BE27",null,null,null,null,null,null,null,null,null,null,"Hardware Finish",{"$f":"+EH11","v":{"$error":"#N/A"}},null,"Resonant Head",{"$f":"VLOOKUP(1,BI60:BJ60,2,FALSE)","v":"Clear Ambassador"},null,"."]
[null,null,"14x14 Floor Tom",0,null,null,"0F White Cortex",null,null,null,null,{"$f":"IF(BD16=1,\"LR2981MT CHROME Rocker Single\", \"LR2981MT Rocker Single Tom Holder\")","v":"LR2981MT Rocker Single Tom Holder"},null,null,null,null,"P1216D Classic Ludwig Bracket ",null,null,null,null,null,null,null,null,null,null,null,null,null,null,null,null,null,null,"",null,null,null,"ft",0,false,0,"14x14",1399,1599,0,null,"0F White Cortex",0,0,null,0,"0F White Cortex",null,0,95,0,{"$f":"IF(BD16=1, \"CHROME Rocker Single\",  \"LR2981MT Rocker Single Tom Holder\")","v":"LR2981MT Rocker Single Tom Holder"},"LS",null,null,null,0,{"$f":"+BL25*DU38","v":0},"L_RL Vibraband w/ Ludwig Brkt",null,"XX",null,0,0,0,0,0,0,null,null,0,0,null,0,null,null,null,null,0,"13x14",null,0,"0Ni Natural w/Matching Inlay",null,null,null,null,{"$f":"+AO60","v":0},"3Hx14",null,{"$f":"SUM(CT22:CT24)","v":0},"Sum of Conflict Finishes",null,null,null,null,null,0,"14x14","44","LLF344",{"$error":"#N/A"},{"$error":"#N/A"},{"$error":"#N/A"},{"$error":"#N/A"}," Cstm  ",{"$error":"#N/A"},true,"",null,null,null,null,null,"DT24",null,"LAP2984MT Atlas Double",153,"BE28",null,null,null,null,null,null,null,null,null,null,"Tom Bracket",{"$f":"VLOOKUP(1,BL23:BN29,3,FALSE)","v":{"$error":"#N/A"}},null,"badge",{"$f":"IF((BL24+BL26)*AQ69>0, CONCATENATE(EK15,\" (X2)\"), EK15)","v":{"$error":"#N/A"}},null,"."]
[null,null,"13x15 Floor Tom",0,null,null,"0P White Marine Pearl",null,null,null,null,{"$f":"IF(BD16=1, \"LR2980MT CHROME Rocker Double\",  \"LR2980MT Rocker Double Tom Holder\")","v":"LR2980MT Rocker Double Tom Holder"},null,null,null,null,"L_RL Vibraband w/ Ludwig Brkt",null,null,null,null,null,null,null,null,null,null,null,null,null,null,null,null,null,null,"",null,null,null,"ft",0,false,0,"13x15",1458,1658,0,null,"0P White Marine Pearl",0,0,null,0,"0P White Marine Pearl",null,0,120,0,{"$f":"IF(BD16=1, \"CHROME Rocker Double\", \"LR2980MT Rocker Double Tom Holder\")","v":"LR2980MT Rocker Double Tom Holder"},"LH",null,null,null,0,{"$f":"+BL26*DU39","v":0},"P7202A Keystone Tom Bracket",null,"KM",null,0,0,0,0,0,0,null,null,0,0,null,0,null,"Tom brackets that won't work with 9.5mm",null,null,0,"14x14",null,0,"0Ta Sable Black w/Accent Inlay",null,null,"7x8",null,{"$f":"SUM(CQ24:CQ25)","v":0},"Sum of conflict sizes",null,null,null,null,{"$f":"+BH49","v":0},"P70",null,null,0,"13x15","35","LLF335",{"$error":"#N/A"},{"$error":"#N/A"},{"$error":"#N/A"},{"$error":"#N/A"}," Cstm  ",{"$error":"#N/A"},true,"",null,null,null,null,null,"DT25",null,"LAP2985MT Atlas Single",123,"BE29",null,null,null,null,null,null,null,null,null,null,null,null,null,null,null,null,"."]
[null,null,"14x15 Floor Tom",0,null,null,"Unused",null,null,null,null,{"$f":"IF(BD16=1, \"LAC2983MT CHROME Atlas Arch\",  \"LAC2983MT Atlas Arch Single\")","v":"LAC2983MT Atlas Arch Single"},null,null,null,null,"P7202A Keystone Tom Bracket",null,null,null,null,null,null,null,null,null,null,null,null,null,null,null,null,null,null,{"$f":"IF(AQ27>0,CONCATENATE(\"qty \",AQ27,\") \",AR27,\"   \"),\"\")","v":""},null,null,null,"ft",0,false,0,"14x15",1458,1658,0,null,"Unused",0,0,null,0,null,null,0,150,0,{"$f":"IF(BD16=1, \"CHROME Atlas Arch\", \"LAC2983MT Atlas Arch Single\")","v":"LAC2983MT Atlas Arch Single"},"AA",null,null,null,0,{"$f":"+BL27*DU40","v":0},"L_RK Vibraband w/ Keystone Bracket",null,"XX",null,0,0,0,0,0,0,null,null,0,0,null,0,null,{"$f":"+BL28","v":0},"P1762B Modular Tom Bracket",null,0,"12x15",null,0,"0Na Natural w/Accent Inlay",null,{"$f":"+AO34","v":0},"7x10",null,null,null,null,{"$f":"+CT25*CT20","v":0},"Error if > 0",null,{"$f":"+BN47+BN48+BN50","v":0},"P32/P33/P71",null,null,0,"14x15","45","LLF345",{"$error":"#N/A"},{"$error":"#N/A"},{"$error":"#N/A"},{"$error":"#N/A"}," Cstm  ",{"$error":"#N/A"},true,"",null,null,null,null,null,"DT26",null,"LR2983MT Rail Consolette 9.5mm",110,"BE30",null,null,null,null,null,null,null,null,null,null,{"$f":"IF(AQ68=1,\"Floor Tom\",CONCATENATE(AQ68,\" Floor Toms Chosen\"))","v":"0 Floor Toms Chosen"},"Check Main Page for Errors",null,null,null,null,"."]
[null,null,"13x16 Floor Tom",0,null,null,"Unused",null,null,null,null,{"$f":"IF(BD16=1,  \"PM0062MT CHROME Atlas Bracket\", \"PM0062MT Atlas Bracket\")","v":"PM0062MT Atlas Bracket"},null,null,null,null,"L_RK Vibraband w/ Keystone Bracket",null,null,null,null,null,null,null,null,null,null,null,null,null,null,null,null,null,null,"",null,null,null,"ft",0,false,0,"13x16",1485,1685,0,null,"Unused",0,0,null,0,null,null,0,50,{"$f":"+BD28*BE28","v":0},{"$f":"IF(BD16=1, \"CHROME Atlas Bracket\", \"PM0062MT Atlas Bracket\")","v":"PM0062MT Atlas Bracket"},"AX",null,null,null,0,{"$f":"+BL28*DU41","v":0},"PM0046 Atlas Tom Bracket",null,"AM",null,0,0,0,0,0,0,null,null,0,0,null,0,null,null,null,null,0,"13x15",null,0,"FF Full Width Wrap",null,{"$f":"SUM(CN26:CN27)","v":0},"Sum of Conflict Sizes",null,{"$f":"+CQ26*CQ22","v":0},"Error if > 0",null,null,null,null,{"$f":"+CW27*CW26","v":0},"Error if > 0",null,null,0,"13x16","36","LLF336",{"$error":"#N/A"},{"$error":"#N/A"},{"$error":"#N/A"},{"$error":"#N/A"}," Cstm  ",{"$error":"#N/A"},true,"",null,null,null,null,null,"DT27",null,"LR2993MT Rail Consolette 10.5mm",110,"BE31",null,null,null,null,null,null,null,null,null,null,{"$f":"+DM32","v":""},null,null,null,null,null,"."]
[null,null,"14x16 Floor Tom",0,null,null,"Unused",null,null,null,null,{"$f":"IF(BD16=1, \"LAP2984MT CHROME Atlas Double\", \"LAP2984MT Atlas Double\")","v":"LAP2984MT Atlas Double"},null,null,null,null,"PM0046 Atlas Tom Bracket",null,null,null,null,null,null,null,null,null,null,null,null,null,null,null,null,null,null,"",null,null,null,"ft",0,false,0,"14x16",1485,1685,0,null,"Unused",0,0,null,0,null,null,{"$f":"IF(K29=\"\",0,1)","v":0},153,{"$f":"+BD29*BE29","v":0},{"$f":"IF(BD16=1,\"CHROME Atlas Double\",  \"LAP2984MT Atlas Double\")","v":"LAP2984MT Atlas Double"},"A2",null,null,null,null,null,null,null,null,null,0,0,0,0,0,0,null,null,0,0,null,0,null,{"$f":"IF(CE27*CE24>0,1,0)","v":0},"Returns a 1 if error",null,0,"14x15",null,0,"FFa Full Width Accent ",null,{"$f":"+CN28*CN24","v":0},"Error if > 0",null,null,null,null,null,"Steinway finish snares",null,null,null,null,null,0,"14x16","46","LLF346",{"$error":"#N/A"},{"$error":"#N/A"},{"$error":"#N/A"},{"$error":"#N/A"}," Cstm  ",{"$error":"#N/A"},true,"",null,null,null,null,null,null,null,null,null,null,null,null,null,null,null,null,null,null,null,null,"Shell Type",{"$f":"IF(AZ69=1,\"Legacy Exotic, LXFTCUSTOM\",\"Lecacy Classic, LCFTCUSTOM\")","v":"Lecacy Classic, LCFTCUSTOM"},null,"Total Floor Toms",{"$f":"SUM(D23:D32)","v":0},null,"."]
[null,null,"15x16 Floor Tom",0,null,null,"Unused",null,null,null,null,{"$f":"IF(BD16=1, \"LAP2985MT CHROME Atlas Single\",  \"LAP2985MT Atlas Single\")","v":"LAP2985MT Atlas Single"},null,null,"TOM BRACKET/FT LEG MIS-MATCH",null,null,null,null,null,null,null,null,null,null,null,null,null,null,null,null,null,null,null,null,"",null,null,null,"ft",0,false,0,"15x16",1485,1685,0,null,"Unused",0,0,null,0,null,null,{"$f":"IF(K30=\"\",0,1)","v":0},123,{"$f":"+BD30*BE30","v":0},{"$f":"IF(BD16=1, \"CHROME Atlas Single\", \"LAP2985MT Atlas Single\")","v":"LAP2985MT Atlas Single"},"A1",null,null,null,null,null,null,null,null,null,0,0,0,0,0,0,null,null,0,0,null,0,null,null,null,null,{"$f":"+AO55","v":0},"14x16",null,null,"MH Matching Hoop",null,null,null,null,{"$f":"+BH49","v":0},"P70 SuperSensitive",null,null,null,null,{"$f":"+BH50","v":0},"P71",null,null,0,"15x16","56","LLF356",{"$error":"#N/A"},{"$error":"#N/A"},{"$error":"#N/A"},{"$error":"#N/A"}," Cstm  ",{"$error":"#N/A"},true,"",null,null,null,null,null,"DT29",null,"Shell Mount Cymbal Holder (Each)",110,"BA44-BA47",null,null,null,null,null,null,null,null,null,null,"Drum Type","Floor Tom",null,null,null,null,"."]
[null,null,"16x16 Floor Tom",0,null,null,"50 Birdseye Maple",null,null,null,null,{"$f":"IF(BD16=1,\"LR2893MT CHROME Rail 9.5mm\",\"LR2983MT Rail Consolette 9.5mm\")","v":"LR2983MT Rail Consolette 9.5mm"},null,null,null,null,"Lug/Bracket Error",null,null,null,null,null,null,null,null,null,null,null,null,null,null,null,null,null,null,"",null,null,null,"ft",0,false,0,"16x16",1485,1685,0,null,"50 Birdseye Maple",0,0,null,0,null,null,{"$f":"IF(K31=\"\",0,1)","v":0},{"$f":"DU27","v":110},{"$f":"+BD31*BE31","v":0},{"$f":"IF(BD16 = 1, \"CHROME Rail 9.5mm\",  \"LR2983MT Rail Consolette 9.5mm\")","v":"LR2983MT Rail Consolette 9.5mm"},"RC",null,null,"Selected",{"$f":"SUM(BL23:BL29)","v":0},{"$f":"SUM(BM23:BM29)","v":0},"Upcharge",null,null,null,0,0,0,0,0,0,null,null,0,0,null,0,null,"12mm Atlas Tom holders",null,null,{"$f":"+AO56","v":0},"16x16",null,0,"0T Sable Hoop",null,null,null,null,null,null,null,null,"57 Black Cherry",null,{"$f":"SUM(BN47:BN49)","v":0},"P32/P33/P70",null,null,0,"16x16","66","LLF366",{"$error":"#N/A"},{"$error":"#N/A"},{"$error":"#N/A"},{"$error":"#N/A"}," Cstm  ",{"$error":"#N/A"},true,"",null,null,null,null,null,null,null,null,null,null,null,null,null,null,null,null,null,null,null,null,"Size",{"$f":"AJ73","v":""},null,null,null,null,"."]
[null,null,"16x18 Floor Tom",0,null,null,"B1 Bubinga Burst (53S)",null,null,null,null,{"$f":"IF(BD16=1, \"LR2993MT CHROME Rail 10.5mm\", \"LR2993MT Rail Consolette 10.5mm\")","v":"LR2993MT Rail Consolette 10.5mm"},null,null,null,"Floor Tom Legs",null,null,null,null,null,null,null,null,null,null,null,null,null,null,null,null,null,null,null,"",null,null,null,"ft",0,false,0,"16x18",1615,1815,0,null,"B1 Bubinga Burst (53S)",0,0,null,0,null,null,{"$f":"IF(K32=\"\",0,1)","v":0},{"$f":"DU28","v":110},{"$f":"+BD32*BE32","v":0},{"$f":"IF(BD16=1, \"CHROME Rail 10.5mm\",  \"LR2993MT Rail Consolette 10.5mm\")","v":"LR2993MT Rail Consolette 10.5mm"},"RC",null,null,null,null,null,null,null,null,null,0,0,0,0,0,0,null,null,0,0,null,0,null,{"$f":"+BD27","v":0},"LAC2983MT Atlas Arch Single",null,{"$f":"+AO57","v":0},"6x12",null,0,"0N Natural Hoop",null,"Size vs. Small Twin",null,null,{"$f":"+AO57","v":0},"6x12",null,null,"58 Black Walnut",null,{"$f":"+CW31*CW30","v":0},"Error if > 0",null,null,0,"16x18","68","LLF368",{"$error":"#N/A"},{"$error":"#N/A"},{"$error":"#N/A"},{"$error":"#N/A"}," Cstm  ",{"$error":"#N/A"},true,"",{"$f":"CONCATENATE(DL23,DL24,DL25,DL26,DL27,DL28,DL29,DL30,DL31,DL32)","v":""},null,null,null,null,null,null,"Floor Tom Legs",null,null,null,null,null,null,null,null,null,null,null,null,"Finish",{"$f":"+EH7","v":{"$error":"#N/A"}},null,"Tone Control",{"$f":"+EK22","v":{"$error":"#N/A"}},null,"."]
[{"$f":"IF(AZ69=1,\"L X T T C U S T O M\",\"L C T T C U S T O M\")","v":"L C T T C U S T O M"},null,"(unassigned)",0,null,null,"FE Fumed Eucalyptus",null,null,null,null,null,null,null,null,null,"LC5023TL Ludwig Floor Tom Legs",null,null,null,null,null,null,null,null,null,null,null,null,null,null,null,null,null,null,"",null,null,null,"tt",0,false,0,null,null,null,0,null,"FE Fumed Eucalyptus",0,0,null,0,null,null,{"$f":"SUM(BD20:BD32)","v":0},"Selected",{"$f":"SUM(BF20:BF32)","v":0},null,null,null,null,null,null,null,null,null,null,null,0,0,0,{"$f":"+$BL$7","v":0},{"$f":"+$BM$31","v":0},0,null,null,{"$f":"IF($BD$16=1,$DU$10,0)","v":0},{"$f":"IF($BL$24+$BL$26>0,$AY$86*2,$AY$86)","v":0},null,0,null,{"$f":"+BD29","v":0},"LAP2984MT Atlas Double",null,null,"3Hx13",null,0,"STa Satin Black w/Accent",null,{"$f":"+BH4","v":0},"Small Twin (SD)",null,{"$f":"+AO58","v":0},"3Hx13",null,null,"62 Makore",null,null,null,null,null,null,null,null,null,null,"brkt","Finish","lugs","vibra","Cstm","Conc","iserror","final",null,null,null,null,"DT32",null,"LTL No Legs or Brackets",0,"BM37",null,null,null,null,null,null,null,null,null,null,"Lugs",{"$f":"HLOOKUP(1,BE6:BG8,3,FALSE)","v":{"$error":"#N/A"}},null,"Batter Head",{"$f":"+EK23","v":{"$error":"#N/A"}},null,"."]
[null,null,"7x10 Tom Tom",0,null,null,"S1 Lacewood Nat-Red/Mahog",null,null,null,null,"Right Handed",null,null,null,null,"LC7202TL Keystone Floor Tom Legs",null,null,null,null,null,null,null,null,null,null,null,null,null,null,null,null,null,null,"",null,null,null,"tt",0,false,0,"7x10",1295,{"$f":"+AS34+200","v":1495},0,null,"S1 Lacewood Nat-Red/Mahog",0,0,null,0,null,null,{"$f":"IF(K34=\"\",0,1)","v":0},null,null,"Right Handed",null,null,null,null,"Floor Tom Legs",null,null,null,"Codif",null,0,0,0,0,0,0,null,null,{"$f":"IF($BD$16=1,$DU$10,0)","v":0},0,null,0,null,{"$f":"+BD30","v":0},"LAP2985MT Atlas Single",null,{"$f":"+AO59","v":0},"6x13",null,0,"SNa Satin Natural w/Accent",null,null,null,null,{"$f":"+AO59","v":0},"6x13",null,null,"63 Pearwood",null,{"$f":"IF(SUM(CW32,CW28,CW24)>0,1,0)","v":0},"Returns a 1 if ANY error",null,null,{"$f":"+AO34","v":0},"7x10","70",{"$f":"IF($AZ$69=1,CONCATENATE(\"LLT4\",DC34),CONCATENATE(\"LLT3\",DC34))","v":"LLT370"},{"$error":"#N/A"},{"$f":"VLOOKUP(1,$BL$23:$BP$29,5,FALSE)","v":{"$error":"#N/A"}},{"$f":"LEFT(VLOOKUP(1,$AU$3:$AW$54,3,FALSE),2)","v":{"$error":"#N/A"}},{"$f":"IF($BE$7=1,\"\",VLOOKUP(1,$DJ$73:$DK$74,2,FALSE))","v":{"$error":"#N/A"}},{"$f":"IF($BE$7+$CQ$8=2,\"WR\",\"R\")","v":"R"},{"$f":"IF($BD$16=1,\"B Cstm  \",\" Cstm  \")","v":" Cstm  "},{"$f":"IF($CQ$8=1,CONCATENATE(DE34,DF34,DG34,DH34,DI34,DJ34),CONCATENATE(DE34,DF34,DG34,DH34,DJ34))","v":{"$error":"#N/A"}},{"$f":"ISERROR(DK34)","v":true},"",null,null,null,null,"DT33",null,"PM0046 Atlas Floor Tom Legs",0,"BM38",null,null,null,null,null,null,null,null,null,null,"Hardware Finish",{"$f":"+EH11","v":{"$error":"#N/A"}},null,"Resonant Head",{"$f":"+EK24","v":"Clear Ambassador"},null,"."]
[null,null,"8x10 Tom Tom",{"$f":"IF($AZ$69=1,AQ35*(AT35+CC35),AQ35*(AS35+CC35))","v":0},null,null,"S2 Lacewood Supernatural",null,null,null,null,"Left Handed",null,null,null,null,"LTL No Legs or Brackets",null,null,null,null,null,null,null,null,null,null,null,null,null,null,null,null,null,null,"",null,null,null,"tt",0,false,0,"8x10",1295,{"$f":"+AS35+200","v":1495},0,null,"S2 Lacewood Supernatural",0,0,null,0,null,null,{"$f":"IF(K35=\"\",0,1)","v":0},null,null,"Left Handed",null,null,null,null,{"$f":"IF(P33=\"\",0,1)","v":0},{"$f":"+BL35*0","v":0},"LC5023TL Ludwig Floor Tom Legs",null,"LX",null,0,0,{"$f":"+$BR$60","v":0},0,0,0,null,null,{"$f":"IF($BD$16=1,$DU$10,0)","v":0},0,null,0,null,{"$f":"IF(SUM(CE32,CE33,CE34)>0,1,0)","v":0},"returns a 1 if 12mm Atlas holder",null,null,"3Hx14",null,{"$f":"IF(AND(SUM(CK4:CK7)>0,SUM(CK20:CK34)>0)=TRUE,1,0)","v":0},"returns a 1 if mis-match",null,{"$f":"+AO63","v":0},"8x14",null,{"$f":"+AO60","v":0},"3Hx14",null,null,"65 Pomele Sapele",null,null,null,null,null,0,"8x10","80","LLT380",{"$error":"#N/A"},{"$f":"VLOOKUP(1,$BL$23:$BP$29,5,FALSE)","v":{"$error":"#N/A"}},{"$f":"LEFT(VLOOKUP(1,$AU$3:$AW$54,3,FALSE),2)","v":{"$error":"#N/A"}},{"$error":"#N/A"},{"$f":"IF($BE$7+$CQ$8=2,\"WR\",\"R\")","v":"R"}," Cstm  ",{"$error":"#N/A"},{"$f":"ISERROR(DK35)","v":true},"",null,null,null,null,null,null,null,null,null,null,null,null,null,null,null,null,null,null,null,"Legs",{"$f":"VLOOKUP(1,BL35:BN38,3,FALSE)","v":{"$error":"#N/A"}},null,"badge",{"$f":"+EK15","v":{"$error":"#N/A"}},null,"."]
[null,null,"9x10 Tom Tom",0,null,null,"L1 Limba Nat/Mahog Brst",null,null,null,null,null,null,null,null,null,"PM0046  Atlas Floor Tom Legs",null,null,null,null,null,null,null,null,null,null,null,null,null,null,null,null,null,null,"",null,null,null,"tt",0,false,0,"9x10",1295,{"$f":"+AS36+200","v":1495},0,null,"L1 Limba Nat/Mahog Brst",0,0,null,0,null,null,null,null,null,null,null,null,null,null,{"$f":"IF(P34=\"\",0,1)","v":0},{"$f":"+BL36*0","v":0},"LC7202TL Keystone Floor Tom Legs",null,"KX",null,0,0,0,0,0,0,null,null,0,0,null,0,null,"Tom brackets that won't work w/Atlas",null,null,{"$f":"+AO63","v":0},"8x14",null,"Wrap Finishes",null,null,{"$f":"+CN35*CN33","v":0},"Error if >0",null,{"$f":"+AO62","v":0},"6Hx14",null,null,"66 East Indian Rosewood",null,null,null,null,null,0,"9x10","90","LLT390",{"$error":"#N/A"},{"$error":"#N/A"},{"$error":"#N/A"},{"$error":"#N/A"},"R"," Cstm  ",{"$error":"#N/A"},true,"",null,null,null,null,null,null,"Tom Tom Brackets",null,null,null,null,null,null,null,null,null,null,null,null,null,null,null,null,null,null,"."]
[null,null,"8x12 Tom Tom",0,null,null,"L2 Limba Supernatural",null,null,null,"Tone Control on Tom/Floor",null,null,null,null,null,"Lug/Leg Error",null,null,null,null,null,null,null,null,null,null,null,null,null,null,null,null,null,null,"",null,null,null,"tt",0,false,0,"8x12",1185,{"$f":"+AS37+200","v":1385},0,null,"L2 Limba Supernatural",0,0,null,0,null,null,"Tone Control on TOMS","Upcharge",null,null,null,null,null,null,{"$f":"IF(P35=\"\",0,1)","v":0},{"$f":"BL37*DU33","v":0},"LTL No Legs or Brackets",null,"XX",null,0,0,0,0,0,0,null,null,0,0,null,0,null,{"$f":"+BL24","v":0},"P1216D Classic Ludwig Bracket ",null,{"$f":"+AO64","v":0},"5x14 8 Lug",null,{"$f":"+AU3","v":0},"0G Black Cortex",null,null,null,null,{"$f":"+AO63","v":0},"8x14",null,null,"sum of conflict finishes",null,null,null,null,null,0,"8x12","82","LLT382",{"$error":"#N/A"},{"$error":"#N/A"},{"$error":"#N/A"},{"$error":"#N/A"},"R"," Cstm  ",{"$error":"#N/A"},true,"",null,null,null,null,"DT36",null,"P1216D Classic Ludwig Bracket ",50,"BM24",null,null,null,null,null,null,null,null,null,null,{"$f":"IF(AQ70=1,\"Snare Drum\",CONCATENATE(AQ70,\" Snare Drums Chosen\"))","v":"0 Snare Drums Chosen"},"Check Main Page for Errors",null,null,null,null,"."]
[null,null,"9x12 Tom Tom",0,null,null,"0N Natural Maple",null,null,null,null,"N  No tone Control",null,null,null,"Snare Hoops",null,null,null,null,null,null,null,null,null,null,null,null,null,null,null,null,null,null,null,"",null,null,null,"tt",0,false,0,"9x12",1185,1385,0,null,"0N Natural Maple",-150,-150,null,0,null,null,{"$f":"IF(K38=\"\",0,1)","v":0},{"$f":"+BD38*0","v":0},"N  No tone Control",null,null,null,null,null,{"$f":"IF(P36=\"\",0,1)","v":0},{"$f":"+BL38*DU34","v":0},"PM0046 Atlas Floor Tom Legs",null,"AX",null,0,0,0,0,0,0,null,null,0,0,null,0,null,{"$f":"+BL25","v":0},"L_RL Vibraband w/ Ludwig Brkt",null,{"$f":"+AO65","v":0},"6Hx14 8 Lug",null,0,"BG Black Galaxy",null,"Size vs. Large Twin",null,null,{"$f":"+AO65","v":0},"6Hx14 8 Lug",null,null,null,null,"Lugs vs Atlas Mount",null,null,null,0,"9x12","92","LLT392",{"$error":"#N/A"},{"$error":"#N/A"},{"$error":"#N/A"},{"$error":"#N/A"},"R"," Cstm  ",{"$error":"#N/A"},true,"",null,null,null,null,"DT37",null,"L_RL Vibraband w/ Ludwig Brkt",50,"BM25",null,null,null,null,null,null,null,null,null,null,{"$f":"+DN66","v":""},null,null,null,null,null,"."]
[null,null,"10x12 Tom Tom",0,null,null,"0T Sable Classic Coat",null,null,null,null,"Y  Internal Tone Control",null,null,null,null,"3F Triple Flanged",null,null,null,null,null,null,null,null,null,null,null,null,null,null,null,null,null,null,"",null,null,null,"tt",{"$f":"IF(B39=\"\",0,1)","v":0},{"$f":"ISNUMBER(B39)","v":false},{"$f":"IF(AP39=TRUE,B39,AO39)","v":0},"10x12",1185,1385,0,null,"0T Sable Classic Coat",-150,-150,null,0,null,null,{"$f":"IF(K39=\"\",0,1)","v":0},{"$f":"+BD39*DU44","v":0},"Y  Internal Tone Control",null,null,null,null,"Selected",{"$f":"SUM(BL35:BL38)","v":0},{"$f":"SUM(BM35:BM38)","v":0},"Upcharge",null,null,null,0,0,0,0,0,0,null,null,0,0,null,0,null,{"$f":"+BL26","v":0},"P7202A Keystone Tom Bracket",null,null,"Anti Brass Lugs",null,0,"0Q Black Oyster Pearl",null,{"$f":"+BI4","v":0},"Large Twin (SD)",null,{"$f":"SUM(CQ32:CQ38)","v":0},"Sum of conflict sizes",null,null,"Sum of Conflict Sizes",null,null,null,null,null,0,"10x12","02","LLT302",{"$error":"#N/A"},{"$error":"#N/A"},{"$error":"#N/A"},{"$error":"#N/A"},"R"," Cstm  ",{"$error":"#N/A"},true,"",null,null,null,null,"DT38",null,"P7202A Keystone Tom Bracket",50,"BM26",null,null,null,null,null,null,null,null,null,null,"Shell Type",{"$f":"IF(AZ69=1,\"Legacy Exotic, LXSDCUSTOM\",\"Legacy Classic, LCSDCUSTOM\")","v":"Legacy Classic, LCSDCUSTOM"},null,"Total Snare Drums",{"$f":"SUM(D57:D65)","v":0},null,"."]
[null,null,"11x12 Tom Tom",0,null,null,null,null,null,null,null,null,null,null,null,null,"PDC Die Cast Hoops",null,null,null,null,null,null,null,null,null,null,null,null,null,null,null,null,null,null,"",null,null,null,"tt",0,false,0,"11x12",1185,1385,0,null,null,0,0,null,0,null,"Selected",{"$f":"SUM(BD38:BD39)","v":0},{"$f":"SUM(BE38:BE39)","v":0},"Upcharge",null,null,"Snare Hoops",null,null,null,null,null,null,null,null,0,0,0,0,0,0,null,null,0,0,null,0,null,{"$f":"+BL27","v":0},"L_RK Vibraband w/ Keystone Bracket",null,{"$f":"SUM(BE4:BE7)","v":0},"Mini Classic",null,0,"0R Black Sparkle",null,null,null,null,null,null,null,null,null,null,{"$f":"+BL28","v":0},"Atlas Tom mount ",null,null,0,"11x12","12","LLT312",{"$error":"#N/A"},{"$error":"#N/A"},{"$error":"#N/A"},{"$error":"#N/A"},"R"," Cstm  ",{"$error":"#N/A"},true,"",null,null,null,null,"DT39",null,"L_RK Vibraband w/ Keystone Bracket",50,"BM27",null,null,null,null,null,null,null,null,null,null,"Drum Type",{"$f":"IF(BD16 = 1,\"Snare w/Brass\",\"Snare Drum\")","v":"Snare Drum"},null,null,null,null,"."]
[null,null,"9x13 Tom Tom",0,null,null,null,null,null,null,null,null,null,null,null,"Size / Hoop Conflict",null,null,null,null,null,null,null,null,null,null,null,null,null,null,null,null,null,null,null,"",null,null,null,"tt",0,false,0,"9x13",1195,1395,0,null,null,0,0,null,null,null,null,null,null,null,null,null,{"$f":"IF(P39=\"\",0,1)","v":0},{"$f":"+BI41*0","v":0},"3F Triple Flanged",null,null,null,null,null,null,0,0,0,0,0,0,null,null,0,0,null,0,null,null,null,null,{"$f":"SUM(BG4:BG7)","v":0},"Long Lugs",null,0,"32 Blue Sparkle",null,{"$f":"+AO57","v":0},"6x12",null,{"$f":"+CQ39*CQ30","v":0},"Error if > 0",null,{"$f":"+CT39*CT37","v":0},"Error if > 0",null,{"$f":"+BG7","v":0},"Long Lugs on Tom",null,null,0,"9x13","93","LLT393",{"$error":"#N/A"},{"$error":"#N/A"},{"$error":"#N/A"},{"$error":"#N/A"},"R"," Cstm  ",{"$error":"#N/A"},true,"",null,null,null,null,"DT40",null,"PM0046 Atlas Tom Bracket",50,"BM28",null,null,null,null,null,null,null,null,null,null,"Size",{"$f":"AJ75","v":""},null,null,null,null,"."]
[null,null,"10x13 Tom Tom",0,null,null,null,null,null,"Badge",{"$f":"IF((BL24+BL26)*AQ69>0, \"Toms will have 2 badges\",\"\")","v":""},null,null,"Throwoff",null,null,null,"Snare Butt",null,null,null,null,null,null,null,null,null,null,null,null,null,null,null,null,null,"",null,null,null,"tt",0,false,0,"10x13",1195,1395,0,null,null,0,0,null,null,null,null,null,null,null,null,null,{"$f":"IF(P40=\"\",0,1)","v":0},{"$f":"+BI42*DU53","v":0},"PDC Die Cast Hoops",null,null,null,null,null,null,0,0,0,0,0,0,null,null,0,0,null,0,null,{"$f":"IF(SUM(CE37,CE38,CE39,CE40)>0,1,0)","v":0},"returns a 1 if anti-ATLAS",null,{"$f":"+BH4","v":0},"Small Twin",null,0,"0C Champagne Sparkle",null,{"$f":"+AO58","v":0},"3Hx13",null,null,null,null,null,null,null,{"$f":"+CW41+CW40","v":0},"Error if > 1",null,null,0,"10x13","03","LLT303",{"$error":"#N/A"},{"$error":"#N/A"},{"$error":"#N/A"},{"$error":"#N/A"},"R"," Cstm  ",{"$error":"#N/A"},true,"",null,null,null,null,null,null,null,null,"BM29",null,null,null,null,null,null,null,null,null,null,"Finish",{"$f":"+EH32","v":{"$error":"#N/A"}},null,"Throwoff",{"$f":"VLOOKUP(1,BH46:BJ50,3,FALSE)","v":{"$error":"#N/A"}},null,"."]
[null,null,"11x13 Tom Tom",0,null,null,null,null,null,null,"GC Cast Brass Badge",null,null,null,"P85 Supraphonic Strainer",null,null,null,"P33 die cast butt",null,null,null,null,null,null,null,null,null,null,null,null,null,null,null,null,"",null,null,null,"tt",0,false,0,"11x13",1195,1395,0,null,null,0,0,null,{"$f":"SUM(BA3:BA40)","v":0},"Selected",null,null,null,null,null,"Selected",{"$f":"SUM(BI41:BI42)","v":0},{"$f":"SUM(BJ41:BJ42)","v":0},"Upcharge",null,null,null,null,null,null,0,0,0,0,0,0,null,null,0,0,null,0,null,null,null,null,{"$f":"+BI4","v":0},"Large Twin",null,0,"35 Customer Supply",null,{"$f":"+AO59","v":0},"6x13",null,{"$f":"+BH50","v":0},"P71 SuperSensitive",null,null,null,null,null,null,null,null,0,"11x13","13","LLT313",{"$error":"#N/A"},{"$error":"#N/A"},{"$error":"#N/A"},{"$error":"#N/A"},"R"," Cstm  ",{"$error":"#N/A"},true,"",null,null,null,null,null,null,null,null,null,null,null,null,null,null,null,null,null,null,null,"Lugs",{"$f":"HLOOKUP(1,BE4:BJ8,5,FALSE)","v":{"$error":"#N/A"}},null,"Butt",{"$f":"VLOOKUP(1,BN47:BP50,3,FALSE)","v":{"$error":"#N/A"}},null,"."]
[null,null,"12x13 Tom Tom",0,null,null,null,null,null,null,"BO Blue/Olive",null,null,null,"P86 Millennium Strainer",null,null,null,"P32 stamped butt",null,null,null,null,null,null,null,null,null,null,null,null,null,null,null,null,"",null,null,null,"tt",0,false,0,"12x13",1195,1395,0,null,null,0,0,null,null,null,null,null,null,null,null,null,null,null,null,null,null,null,null,null,null,0,0,0,0,0,0,null,null,0,0,null,0,null,{"$f":"IF(CE42*CE35>0,1,0)","v":0},"Returns a 1 if error",null,{"$f":"SUM(BL11:BL12,BL16)","v":0},"Anti Brass Spurs",null,0,"33 Gold Sparkle",null,{"$f":"+AO60","v":0},"3Hx14",null,null,null,null,null,null,null,{"$f":"+BL38","v":0},"Atlas Floor Tom Legs",null,null,0,"12x13","23","LLT323",{"$error":"#N/A"},{"$error":"#N/A"},{"$error":"#N/A"},{"$error":"#N/A"},"R"," Cstm  ",{"$error":"#N/A"},true,"",null,null,null,null,"DT43",null,"Internal Tone Control (tom, floor, snare)",25,"BE39",null,null,null,null,null,null,null,null,null,null,"Hardware Finish",{"$f":"IF(BD16=1,\"Brass Plated\",\"Chrome Plated\")","v":"Chrome Plated"},null,"Hoops",{"$f":"VLOOKUP(1,BI41:BK42,3,FALSE)","v":{"$error":"#N/A"}},null,"."]
[null,null,"10x14 Tom Tom",0,null,null,null,null,null,null,"SGK Small Legacy Keystone",null,null,null,"P80 Piccolo Strainer",null,null,null,null,null,null,null,null,null,null,null,null,null,null,null,null,null,null,null,null,"",null,null,null,"tt",0,false,0,"10x14",1315,1515,0,null,null,0,0,null,null,null,null,null,null,null,null,"Snare Throwoff",null,null,null,null,null,null,null,null,null,0,0,0,0,0,0,null,null,0,0,null,0,null,null,null,null,{"$f":"+BH11+BH12","v":0},"Claws",null,0,"54 Green Sparkle",null,{"$f":"+AO61","v":0},"5x14",null,{"$f":"+AO57","v":0},"6x12",null,"Badge vs Finish (disabled)",null,null,{"$f":"+BG6","v":0},"Long Lugs on Floor Tom",null,null,0,"10x14","04","LLT304",{"$error":"#N/A"},{"$error":"#N/A"},{"$error":"#N/A"},{"$error":"#N/A"},"R"," Cstm  ",{"$error":"#N/A"},true,"",null,null,null,null,null,null,null,null,null,null,null,null,null,null,null,null,null,null,null,"Tone Control",{"$f":"VLOOKUP(1,BM55:BO56,3,FALSE)","v":{"$error":"#N/A"}},null,"Batter Head",{"$f":"VLOOKUP(1,BD62:BE63,2,FALSE)","v":{"$error":"#N/A"}},null,"."]
[null,null,"11x14 Tom Tom",0,null,null,null,null,null,"Badge / Finish Conflict",null,null,null,null,null,null,null,null,null,null,null,null,null,null,null,null,null,null,null,null,null,null,null,null,null,"",null,null,null,"tt",0,false,0,"11x14",1315,1515,0,null,null,0,0,null,null,null,null,null,null,null,null,{"$f":"IF(N43=\"\",0,1)","v":0},{"$f":"+BH46*0","v":0},"P85 Supraphonic Strainer",null,null,null,"Snare Butt",null,null,null,0,0,0,0,0,0,null,null,0,0,null,0,null,{"$f":"IF(OR(CE17=1,CE29=1,CE44=1) = TRUE,1,0)","v":0},"Returns a 1 if any error",null,{"$f":"+BD11","v":0},"Bass Screws",null,0,"JW Jumbo White",null,{"$f":"+AO64","v":0},"5x14 8 Lug",null,{"$f":"+AO58","v":0},"3Hx13",null,null,null,null,{"$f":"+CW45+CW44","v":0},"Error if > 1",null,null,0,"11x14","14","LLT314",{"$error":"#N/A"},{"$error":"#N/A"},{"$error":"#N/A"},{"$error":"#N/A"},"R"," Cstm  ",{"$f":"IF($CQ$8=1,CONCATENATE(DE46,DF46,DG46,DH46,DI46,DJ46),CONCATENATE(DE46,DF46,DG46,DH46,DJ46))","v":{"$error":"#N/A"}},true,"",null,null,null,null,null,null,"Snare Throwoff",null,null,null,null,null,null,null,null,null,null,null,null,null,null,null,"Badge",{"$f":"+EK15","v":{"$error":"#N/A"}},null,"."]
[null,null,"12x14 Tom Tom",0,null,null,null,null,null,null,null,null,null,null,null,null,"Throwoff / Butt Mis-match",null,null,null,null,null,null,null,null,null,null,null,null,null,null,null,null,null,null,"",null,null,null,"tt",0,false,0,"12x14",1315,1515,0,null,null,0,0,null,null,null,null,null,null,null,null,{"$f":"IF(N44=\"\",0,1)","v":0},{"$f":"+BH47*DU47","v":0},"P86 Millennium Strainer",null,null,null,{"$f":"IF(R43=\"\",0,1)","v":0},{"$f":"+BN47*0","v":0},"P33 die cast butt",null,0,0,0,0,0,0,null,null,0,0,null,0,null,null,null,null,null,"Tom Holder (changed to allow chrome tom holders)",null,0,"36 Olive Sparkle",null,{"$f":"SUM(CN41:CN46)","v":0},"Sum of Conflict Sizes",null,{"$f":"+AO59","v":0},"6x13",null,{"$f":"+AX82","v":0},"Small Legacy Keystone",null,null,null,null,null,0,"12x14","24","LLT324",{"$error":"#N/A"},{"$error":"#N/A"},{"$error":"#N/A"},{"$error":"#N/A"},"R"," Cstm  ",{"$error":"#N/A"},true,"",null,null,null,null,"DT46",null,"P86 Millennium Strainer",45,"BI47",null,null,null,null,null,null,null,null,null,null,null,null,null,null,null,null,"."]
[null,null,"13x14 Tom Tom",0,null,null,null,null,null,null,null,null,null,"Size / Throwoff Conflict",null,null,null,"Tone Control on Snare",null,null,null,null,null,null,null,null,null,null,null,null,null,null,null,null,null,"",null,null,null,"tt",0,false,0,"13x14",1315,1515,0,null,null,0,0,null,null,null,null,null,null,null,null,{"$f":"IF(N45=\"\",0,1)","v":0},{"$f":"+BH48*0","v":0},"P80 Piccolo Strainer",null,null,null,{"$f":"IF(R44=\"\",0,1)","v":0},{"$f":"BN48*DU51","v":0},"P32 stamped butt",null,0,0,0,0,0,0,null,null,0,0,null,0,null,null,null,null,{"$f":"SUM(BL26:BL29)","v":0},"Tom Bracket",null,0,"RP Red Oyster",null,{"$f":"+CN47*CN39","v":0},"Error if > 0",null,{"$f":"+AO60","v":0},"3Hx14",null,null,null,null,null,null,null,null,0,"13x14","34","LLT334",{"$error":"#N/A"},{"$error":"#N/A"},{"$error":"#N/A"},{"$error":"#N/A"},"R"," Cstm  ",{"$error":"#N/A"},true,"",null,null,null,null,"DT47",null,"P70 Super Sensitive",270,"BI49",null,null,null,null,null,null,null,null,null,null,null,null,null,null,null,null,"."]
[null,null,"14x14 Tom Tom",0,null,null,null,null,null,null,"Batter Head",null,null,null,null,null,null,null,"N  No Tone Control",null,null,null,null,null,null,null,null,null,null,null,null,null,null,null,null,"",null,null,null,"tt",0,false,0,"14x14",1315,1515,null,null,null,0,0,null,null,null,null,null,null,null,null,{"$f":"IF(N46=\"\",0,1)","v":0},{"$f":"+BH49*DU48","v":0},"P70 Super Sensitive",null,null,null,{"$f":"IF(R45=\"\",0,1)","v":0},{"$f":"+BN49*0","v":0},"P70 Super Sensitive",null,0,0,0,0,0,0,null,null,0,0,null,0,null,"Tom Brkt vs Floor Tom Leg",null,null,{"$f":"+BD39","v":0},"Tone Control (toms)",null,0,"27 Red Sparkle",null,null,null,null,{"$f":"+AO61","v":0},"5x14",null,null,"New Finishes",null,{"$f":"+BD27","v":0},"Atlas Arch Tom Holder",null,null,0,"14x14","44","LLT344",{"$error":"#N/A"},{"$error":"#N/A"},{"$error":"#N/A"},{"$error":"#N/A"},"R"," Cstm  ",{"$error":"#N/A"},true,"",null,null,null,null,"DT48",null,"P71 Super Sensitive",270,"BI50",null,null,null,null,null,null,null,null,null,null,"Dealer",{"$f":"+K1","v":0},null,null,null,null,"."]
[null,null,"12x15 Tom Tom",0,null,null,null,null,null,"Bass","X","PS3 Clear",null,null,"Reso Head",null,null,null,"Y  Internal Tone Control",null,null,null,null,null,null,null,null,null,null,null,null,null,null,null,null,"",null,null,null,"tt",0,false,0,"12x15",1375,1575,null,null,null,0,0,null,null,null,null,null,null,null,null,{"$f":"IF(N47=\"\",0,1)","v":0},{"$f":"+BH50*DU49","v":0},"P71 Super Sensitive",null,null,null,{"$f":"IF(R46=\"\",0,1)","v":0},{"$f":"+BN50*0","v":0},"P71 Super Sensitive",null,0,0,0,0,0,0,null,null,0,0,null,0,null,null,null,null,{"$f":"SUM(AZ60:AZ61)","v":0},"Shell Mount",null,0,"SP ShamPayne",null,null,null,null,{"$f":"+AO63","v":0},"8x14",null,null,"taken from the grid",null,{"$f":"+BG5","v":0},"Long Lugs on Bass Drum",null,null,0,"12x15","25","LLT325",{"$error":"#N/A"},{"$error":"#N/A"},{"$error":"#N/A"},{"$error":"#N/A"},"R"," Cstm  ",{"$error":"#N/A"},true,"",null,null,null,null,null,null,null,null,null,null,null,null,null,null,null,null,null,null,null,"PO",{"$f":"+P1","v":0},null,null,null,null,"."]
[null,null,"13x15 Tom Tom",0,null,null,null,null,null,null,null,null,null,"Bass",null,"PS3 Ebony w/Logo",null,null,null,null,null,null,null,null,null,null,null,null,null,null,null,null,null,null,null,"",null,null,null,"tt",0,false,0,"13x15",1375,1575,null,null,null,0,0,null,null,null,null,null,null,null,"Selected",{"$f":"SUM(BH46:BH50)","v":0},{"$f":"SUM(BI46:BI50)","v":0},"Upcharge",null,null,"Selected",{"$f":"SUM(BN47:BN50)","v":0},{"$f":"SUM(BO47:BO50)","v":0},"Upcharge",null,0,0,0,0,0,0,null,null,0,0,null,0,null,"Ludwig Tom Brkts and Keystone FT Legs",null,null,{"$f":"+BL36+BL38","v":0},"Floor Tom Legs",null,0,"1V Silver Glass Glitter",null,"Size vs. Tube Lugs",null,null,{"$f":"+AO64","v":0},"5x14 8 Lug",null,{"$f":"+CT49*CT47","v":0},"error if > 0",null,{"$f":"SUM(CW49:CW50)","v":0},"Error if > 1",null,null,0,"13x15","35","LLT335",{"$error":"#N/A"},{"$error":"#N/A"},{"$error":"#N/A"},{"$error":"#N/A"},"R"," Cstm  ",{"$error":"#N/A"},true,"",null,null,null,null,"DT50",null,"P32 stamped butt",0,"BO48",null,null,null,null,null,null,null,null,null,null,null,null,null,null,null,null,"."]
[null,null,"14x15 Tom Tom",0,null,null,null,null,null,"Toms",null,"Clear Emperor",null,null,null,"PS3 Smth White w/Logo",null,null,null,null,null,null,null,null,null,null,null,null,null,null,null,null,null,null,null,"",null,null,null,"tt",0,false,0,"14x15",1375,1575,null,null,null,0,0,null,null,null,null,null,null,null,null,null,null,null,null,null,null,null,null,null,null,0,0,0,0,0,0,null,null,0,0,null,0,null,{"$f":"+BL23","v":0},"NBKT No Mounting Bracket",null,{"$f":"+BM56","v":0},"Tone Control (snare)",null,0,"0S Silver Sparkle",null,{"$f":"+BJ4","v":0},"Tube Lugs (SD)",null,{"$f":"SUM(CQ45:CQ51)","v":0},"Sum of conflict sizes",null,null,null,null,{"$f":"IF(OR(CW51>1,CW46>1,CW42>1),1,0)","v":0},"Returns a 1 if lug/mnt error",null,null,0,"14x15","45","LLT345",{"$error":"#N/A"},{"$error":"#N/A"},{"$error":"#N/A"},{"$error":"#N/A"},"R"," Cstm  ",{"$error":"#N/A"},true,"",null,null,null,null,null,null,null,null,null,null,null,null,null,null,null,null,null,null,null,null,null,null,null,null,null,"."]
[null,null,"13x16 Tom Tom ",0,null,null,null,null,null,null,null,"Clear Ambassador",null,null,null,"PS3 Clr w/Script Logo",null,null,null,null,null,null,null,null,null,null,null,null,null,null,null,null,null,null,null,"",null,null,null,"tt",0,false,0,"13x16",1450,1650,null,null,null,0,0,null,null,null,null,null,null,null,null,null,null,null,null,null,null,null,null,null,null,0,0,0,0,0,0,null,null,0,0,null,0,null,{"$f":"+BL24","v":0},"P1216D Classic Ludwig Bracket ",null,{"$f":"+BI41","v":0},"3F hoop on snare",null,0,"52 Sky Blue Pearl",null,null,null,null,null,null,null,null,null,null,null,null,null,null,0,"13x16","36","LLT336",{"$error":"#N/A"},{"$error":"#N/A"},{"$error":"#N/A"},{"$error":"#N/A"},"R"," Cstm  ",{"$error":"#N/A"},true,"",null,null,null,null,"DT52",null,"PDC Die Cast Hoops on Snare",85,"BI42",null,null,null,null,null,null,null,null,null,null,null,null,null,null,null,null,"."]
[null,null,"14x16 Tom Tom",0,null,null,null,null,null,null,null,"Ctd Ambassador",null,null,null,null,null,null,null,null,null,null,null,null,null,null,null,null,null,null,null,null,null,null,null,"",null,null,null,"tt",0,false,0,"14x16",1450,1650,null,null,null,0,0,null,null,null,null,null,null,null,null,null,null,null,null,null,"Tone Control on Snare","Upcharge",null,null,null,0,0,0,0,0,0,null,null,0,0,null,0,null,{"$f":"+BL25","v":0},"L_RL Vibraband w/ Ludwig Brkt",null,{"$f":"SUM(BH46,BH48:BH50)","v":0},"Throwoff",null,0,"37 Teal Blue Sparkle",null,{"$f":"+AO63","v":0},"8x14",null,{"$f":"+CQ52*CQ43","v":0},"Error if > 0",null,null,"LGK Large Gold Keystone",null,null,null,null,null,0,"14x16","46","LLT346",{"$error":"#N/A"},{"$error":"#N/A"},{"$error":"#N/A"},{"$error":"#N/A"},"R"," Cstm  ",{"$error":"#N/A"},true,"",null,null,null,null,null,null,null,null,null,null,null,null,null,null,null,null,null,null,null,null,null,null,null,null,null,"."]
[null,null,"15x16 Tom Tom",0,null,null,"Bass Drum Hoop Error",null,null,null,null,null,null,"Toms","X","Clear Ambassador",null,null,null,null,null,null,null,null,null,null,null,null,null,null,null,null,null,null,null,"",null,null,null,"tt",0,false,0,"15x16",1450,1650,{"$f":"SUM(AU3:AU54)","v":0},null,null,null,null,null,null,null,null,"Batter Head",null,null,null,null,"Reso Head",null,null,null,{"$f":"IF(R49=\"\",0,1)","v":0},{"$f":"+BM55*0","v":0},"N  No Tone Control",null,null,0,0,0,0,0,0,null,null,0,0,null,0,null,{"$f":"+BL36","v":0},"LC7202TL Keystone Floor Tom Legs",null,{"$f":"SUM(BN48:BN50)","v":0},"Butt",null,0,"1Q Vintage Black Oyster",null,{"$f":"+CN54*CN52","v":0},"Error if >0",null,null,null,null,null,null,null,"Size (Depth) vs Spurs",null,null,null,0,"15x16","56","LLT356",{"$error":"#N/A"},{"$error":"#N/A"},{"$error":"#N/A"},{"$error":"#N/A"},"R"," Cstm  ",{"$error":"#N/A"},true,"",null,null,null,null,null,null,"Gold Cast Badge",15,null,null,null,null,null,null,null,null,null,null,null,null,null,null,null,null,null,"."]
[null,null,"16x16 Tom Tom",0,null,"Bass Drum Hoops",null,null,null,"Snare",null,"33 Med Coated ",null,null,null,null,null,null,null,null,null,null,null,null,null,null,null,null,null,null,null,null,null,null,null,"",null,null,null,"tt",0,false,0,"16x16",1450,1650,null,null,null,null,null,null,null,null,"Bass",{"$f":"IF(K50=\"\",0,1)","v":1},"PS3 Clear",null,null,"Bass",{"$f":"IF(O51=\"\",0,1)","v":0},"PS3 Ebony w/Logo",null,null,{"$f":"IF(R50=\"\",0,1)","v":0},{"$f":"+BM56*25","v":0},"Y  Internal Tone Control",null,null,0,0,0,0,0,0,null,null,0,0,null,0,null,{"$f":"SUM(CE52:CE55)","v":0},"Error if >1",null,{"$f":"SUM(CH5:CH55)","v":0},"Total Anti-brass Choices",null,0,"2Q Vintage Blue Oyster",null,null,null,null,{"$f":"+BH48","v":0},"P80 Piccolo",null,null,"Conflict Finishes",null,null,null,null,null,0,"16x16","66","LLT366",{"$error":"#N/A"},{"$error":"#N/A"},{"$error":"#N/A"},{"$error":"#N/A"},"R"," Cstm  ",{"$error":"#N/A"},true,"",{"$f":"CONCATENATE(DM34,DM35,DM36,DM37,DM38,DM39,DM40,DM41,DM42,DM43,DM44,DM45,DM46,DM47,DM48,DM49,DM50,DM51,DM52,DM53,DM54,DM55,DM56)","v":""},null,null,null,null,null,"Blue/Olive Badge (each)",15,null,null,null,null,null,null,null,null,null,null,null,null,null,null,null,null,null,"."]
[{"$f":"IF(AZ69=1,\"L X S D C U S T O M\",\"L C S D C U S T O M\")","v":"L C S D C U S T O M"},null,"6x12 Snare",0,null,null,"STi Satin Black w/Inlay",null,null,null,null,"43 Hvy Coated ",null,null,null,null,null,null,null,null,null,null,null,null,null,null,null,null,null,null,null,null,null,null,null,"",null,null,null,"sd",0,false,0,"6x12",902,1102,null,null,null,null,null,null,null,null,null,null,null,null,null,null,0,"PS3 Smth White w/Logo",null,"Selected",{"$f":"SUM(BM55:BM56)","v":0},{"$f":"SUM(BN55:BN56)","v":0},"Upcharge",null,null,0,0,{"$f":"+$BS$60","v":0},{"$f":"+$BL$4","v":0},{"$f":"+$BI$51","v":0},{"$f":"+$BN$57","v":0},{"$f":"+$BO$51","v":0},{"$f":"+$BJ$43","v":0},{"$f":"IF($BD$16=1,$DU$11,0)","v":0},{"$f":"$AY$86","v":0},null,0,null,null,null,null,null,null,null,0,"NS Vintage Nickel Sparkle",null,null,null,null,null,null,null,null,"taken from the grid",null,{"$f":"AO3","v":0},"12x18",null,null,0,"6x12","62",{"$f":"IF($AZ$69=1,CONCATENATE(\"LLS4\",DC57),CONCATENATE(\"LLS3\",DC57))","v":"LLS362"},{"$error":"#N/A"},{"$f":"IF($BI$42=1,CONCATENATE(VLOOKUP(1,$DA$72:$DB$75,2,FALSE),\"D\"),CONCATENATE(VLOOKUP(1,$DA$72:$DB$75,2,FALSE),\"X\"))","v":{"$error":"#N/A"}},{"$f":"LEFT(VLOOKUP(1,$AU$3:$AW$54,2,FALSE),2)","v":{"$error":"#N/A"}},{"$f":"IF($BH$47=1,\"WM\",\"\")","v":""},{"$f":"IF($BD$16=1,\"B\",\"\")","v":""}," Cstm  ",{"$f":"CONCATENATE(DE57,DF57,DG57,DH57,DI57,DJ57)","v":{"$error":"#N/A"}},true,"",null,null,null,null,null,null,"Small Keystone Badge (each)",0,null,null,null,null,null,null,null,null,null,null,null,null,null,null,null,null,null,"."]
[null,null,"(unassigned)",0,null,null,"SNi Satin Natural w/Inlay",null,null,null,null,null,null,null,null,null,null,null,null,null,null,null,null,null,null,null,null,null,null,null,null,null,null,null,null,"",null,null,null,"sd",0,false,0,null,null,null,null,null,null,null,null,"Shell Mount Cymbal Holder",null,null,"Toms",{"$f":"IF(K52=\"\",0,1)","v":0},"Clear Emperor",null,null,null,0,"PS3 Clr w/Script Logo",null,null,null,null,null,null,null,0,0,0,{"$f":"+$BL$4","v":0},0,0,0,0,{"$f":"IF($BD$16=1,$DU$11,0)","v":0},0,null,0,null,"Keystone Tom Brkts and Ludwig FT Legs",null,null,{"$f":"+BD16","v":0},"BRASS HARDWARE chosen",null,0,"NM Vintage White Marine",null,null,null,null,{"$f":"+AO57","v":0},"6x12",null,{"$f":"+CT56+CT54","v":0},"Error if > 0",null,{"$f":"AO6","v":0},"12x20",null,null,null,null,null,null,"size","lug/hoop","finish","throw","brass"," Cstm  ",null,null,null,null,null,null,null,null,null," ",null,null,null,null,null,null,null,null,null,null,null,null,null,null,null,null,null,null,"."]
[null,null,"6x13 Snare",0,null,null,"ST Satin Black",null,null,null,null," Shell Mount Cymbal Holder",null,null,null,null,null,null,null,null,null,null,null,null,null,null,null,null,null,null,null,null,null,null,null,"",null,null,null,"sd",0,false,0,"6x13",929,1129,null,null,null,null,null,{"$f":"IF(L60=\"\",0,1)","v":0},null,"None",null,{"$f":"IF(K53=\"\",0,1)","v":0},"Clear Ambassador",null,null,null,null,null,null,null,null,null,null,null,null,null,null,0,{"$f":"+$BL$4","v":0},0,0,0,0,{"$f":"IF($BD$16=1,$DU$11,0)","v":0},0,null,0,null,{"$f":"+BL26","v":0},"P7202A Keystone Tom Bracket",null,null,null,null,0,"0F White Cortex",null,"Size vs Long Lugs & Keyrods",null,null,{"$f":"+AO59","v":0},"6x13",null,null,null,null,{"$f":"AO10","v":0},"12x22",null,null,{"$f":"+AO59","v":0},"6x13","63",{"$f":"IF($AZ$69=1,CONCATENATE(\"LLS4\",DC59),CONCATENATE(\"LLS3\",DC59))","v":"LLS363"},{"$error":"#N/A"},{"$f":"IF($BI$42=1,CONCATENATE(VLOOKUP(1,$DA$72:$DB$75,2,FALSE),\"D\"),CONCATENATE(VLOOKUP(1,$DA$72:$DB$75,2,FALSE),\"X\"))","v":{"$error":"#N/A"}},{"$f":"LEFT(VLOOKUP(1,$AU$3:$AW$54,3,FALSE),2)","v":{"$error":"#N/A"}},{"$f":"IF($BH$47=1,\"WM\",\"\")","v":""},{"$f":"IF($BD$16=1,\"B\",\"\")","v":""}," Cstm  ",{"$f":"CONCATENATE(DE59,DF59,DG59,DH59,DI59,DJ59)","v":{"$error":"#N/A"}},true,"",null,null,null,null,null,null,null,null,null,null,null,null,null,null,null,null,null,null,null,null,null,null,null,null,null,"."]
[null,null,"(unassigned)",0,null,null,"SN Satin Natural",null,null,null,null,null,"None",null,null,null,null,null,null,null,null,null,null,null,null,null,null,null,null,null,null,null,null,null,null,"",null,null,null,"sd",0,false,0,null,null,null,null,null,null,null,null,0,null,"Classic P1216 Brkt",null,{"$f":"IF(K54=\"\",0,1)","v":0},"Ctd Ambassador",null,null,"Toms",{"$f":"IF(O55=\"\",0,1)","v":1},"Clear Ambassador",null,null,null,null,null,null,null,{"$f":"SUM(BR3:BR59)","v":0},{"$f":"SUM(BS3:BS59)","v":0},0,{"$f":"+$BL$4","v":0},0,0,0,0,0,0,null,0,null,{"$f":"+BL27","v":0},"L_RK Vibraband w/ Keystone Bracket",null,{"$f":"IF(CH56*CH58>0,1,0)","v":0},"returns a 1 if plating error.",null,0,"0P White Marine Pearl",null,null,null,null,{"$f":"+AO61","v":0},"5x14",null,null,null,null,{"$f":"AO15","v":0},"12x24",null,null,null,null,null,null,null,null,null,null,null,null,null,null,null,null,null,null,null,null,null,"STi Satin Black w/Inlay",0,null,null,null,null,null,null,null,null,null,null,null,null,null,null,null,null,null,"."]
[null,null,"5x14 Snare",0,null,null,"0Ti Sable Black w/Matching Inlay",null,null,null,null,null,"Classic P1216 Brkt",null,null,null,null,null,null,null,null,null,null,null,null,null,null,null,null,null,null,null,null,null,null,"",null,null,null,"sd",0,false,0,"5x14",891,1091,null,null,"Bass Drum Hoops","Upcharge",null,0,null,"Keystone P7202 Brkt",null,null,null,null,null,null,null,null,null,null,null,null,null,null,null,null,null,0,0,0,0,0,0,0,0,null,0,null,{"$f":"+BL35","v":0},"LC5023TL Ludwig Floor Tom Legs",null,null,null,null,0,null,null,null,"20x20",null,{"$f":"+AO62","v":0},"6Hx14",null,null,null,null,{"$f":"AO20","v":0},"12x26",null,null,{"$f":"+AO61","v":0},"5x14","54",{"$f":"IF($AZ$69=1,CONCATENATE(\"LLS4\",DC61),CONCATENATE(\"LLS3\",DC61))","v":"LLS354"},{"$error":"#N/A"},{"$f":"IF($BI$42=1,CONCATENATE(VLOOKUP(1,$DA$72:$DB$75,2,FALSE),\"D\"),CONCATENATE(VLOOKUP(1,$DA$72:$DB$75,2,FALSE),\"X\"))","v":{"$error":"#N/A"}},{"$f":"LEFT(VLOOKUP(1,$AU$3:$AW$54,3,FALSE),2)","v":{"$error":"#N/A"}},{"$f":"IF($BH$47=1,\"WM\",\"\")","v":""},{"$f":"IF($BD$16=1,\"B\",\"\")","v":""}," Cstm  ",{"$f":"CONCATENATE(DE61,DF61,DG61,DH61,DI61,DJ61)","v":{"$error":"#N/A"}},true,"",null,null,null,null,null,null,"SNi Satin Natural w/Inlay",0,null,null,null,null,null,null,null,null,null,null,null,null,null,null,null,null,null,"."]
[null,null,"6Hx14 Snare",0,null,null,"0Ni Natural w/Matching Inlay",null,null,null,null,null,"Keystone P7202 Brkt",null,null,null,null,null,null,null,null,null,null,null,null,null,null,null,null,null,null,null,null,null,null,"",null,null,null,"sd",0,false,0,"6Hx14",967,1167,{"$f":"IF(F57=\"\",0,1)","v":0},null,"STi Satin Black w/Inlay",{"$f":"AU62*DU60","v":0},null,0,{"$f":"+AZ62*DU30","v":0},"Left Front","Snare",{"$f":"IF(K56=\"\",0,1)","v":0},"33 Med Coated ",null,null,null,null,null,null,null,null,null,null,null,null,null,null,0,0,0,0,0,0,0,0,null,0,null,{"$f":"SUM(CE59:CE61)","v":0},"Error if >1",null,null,null,null,0,null,null,{"$f":"+AO14","v":0},"20x22",null,{"$f":"+AO63","v":0},"8x14",null,null,null,null,null,null,null,null,{"$f":"+AO62","v":0},"6Hx14","64",{"$f":"IF($AZ$69=1,CONCATENATE(\"LLS4\",DC62),CONCATENATE(\"LLS3\",DC62))","v":"LLS364"},{"$error":"#N/A"},{"$f":"IF($BI$42=1,CONCATENATE(VLOOKUP(1,$DA$72:$DB$75,2,FALSE),\"D\"),CONCATENATE(VLOOKUP(1,$DA$72:$DB$75,2,FALSE),\"X\"))","v":{"$error":"#N/A"}},{"$f":"LEFT(VLOOKUP(1,$AU$3:$AW$54,3,FALSE),2)","v":{"$error":"#N/A"}},"",{"$f":"IF($BD$16=1,\"B\",\"\")","v":""}," Cstm  ",{"$f":"CONCATENATE(DE62,DF62,DG62,DH62,DI62,DJ62)","v":{"$error":"#N/A"}},true,"",null,null,null,null,null,null,"ST Satin Black",0,null,null,null,null,null,null,null,null,null,null,null,null,null,null,null,null,null,"."]
[null,null,"8x14 Snare",0,null,null,"0Ta Sable Black w/Accent Inlay",null,null,null,null,null,"Left Front",null,null,null,null,null,null,null,null,null,null,null,null,null,null,null,null,null,null,null,null,null,null,"",null,null,null,"sd",0,false,0,"8x14",1015,1215,0,null,"SNi Satin Natural w/Inlay",0,null,0,{"$f":"+AZ63*DU30","v":0},"Right Front",null,{"$f":"IF(K57=\"\",0,1)","v":0},"43 Hvy Coated ",null,null,null,null,null,null,null,null,null,null,null,null,null,null,0,0,0,0,0,0,0,0,null,0,null,null,null,null,null,null,null,0,null,null,{"$f":"+AO19","v":0},"20x24",null,{"$f":"+AO64","v":0},"5x14 8 Lug",null,null,null,null,{"$f":"SUM(CW57:CW62)","v":0},"Conflict sizes",null,null,{"$f":"+AO63","v":0},"8x14","84",{"$f":"IF($AZ$69=1,CONCATENATE(\"LLS4\",DC63),CONCATENATE(\"LLS3\",DC63))","v":"LLS384"},{"$error":"#N/A"},{"$f":"IF($BI$42=1,CONCATENATE(VLOOKUP(1,$DA$72:$DB$75,2,FALSE),\"D\"),CONCATENATE(VLOOKUP(1,$DA$72:$DB$75,2,FALSE),\"X\"))","v":{"$error":"#N/A"}},{"$f":"LEFT(VLOOKUP(1,$AU$3:$AW$54,3,FALSE),2)","v":{"$error":"#N/A"}},"",{"$f":"IF($BD$16=1,\"B\",\"\")","v":""}," Cstm  ",{"$f":"CONCATENATE(DE63,DF63,DG63,DH63,DI63,DJ63)","v":{"$error":"#N/A"}},true,"",null,null,null,null,null,null,"SN Satin Natural",0,null,null,null,null,null,null,null,null,null,null,null,null,null,null,null,null,null,"."]
[null,null,"5x14 8 Lug Snare",0,null,null,"0Na Natural w/Accent Inlay",null,null,null,null,null,"Right Front",null,null,null,null,null,null,null,null,null,null,null,null,null,null,null,null,null,null,null,null,null,null,"",null,null,null,"sd",0,false,0,"5x14 8 Lug",891,1091,0,null,"ST Satin Black",0,null,0,{"$f":"+AZ64*DU30","v":0},"Left Back",null,null,null,null,null,null,null,null,null,null,null,null,null,null,null,null,null,0,0,0,0,0,0,0,0,null,0,null,{"$f":"IF(OR(CE56>1,CE62>1)=TRUE,1,0)","v":0},"Returns a 1 if any error.",null,null,null,null,0,null,null,{"$f":"IF(SUM(CN61:CN63)>0,1,0)","v":0},"20\" deep drums ",null,{"$f":"+AO65","v":0},"6Hx14 8 Lug",null,null,null,null,{"$f":"+BL14","v":0},"2 pr Curved spurs",null,null,{"$f":"+AO64","v":0},"5x14 8 Lug","54",{"$f":"IF($AZ$69=1,CONCATENATE(\"LLS4\",DC64),CONCATENATE(\"LLS3\",DC64))","v":"LLS354"},{"$error":"#N/A"},{"$f":"IF($BI$42=1,CONCATENATE(VLOOKUP(1,$DA$72:$DB$75,2,FALSE),\"D\"),CONCATENATE(VLOOKUP(1,$DA$72:$DB$75,2,FALSE),\"X\"))","v":{"$error":"#N/A"}},{"$f":"LEFT(VLOOKUP(1,$AU$3:$AW$54,3,FALSE),2)","v":{"$error":"#N/A"}},"",{"$f":"IF($BD$16=1,\"B\",\"\")","v":""}," Cstm  ",{"$f":"CONCATENATE(DE64,DF64,DG64,DH64,DI64,DJ64)","v":{"$error":"#N/A"}},true,"",null,null,null,null,null,null,"0Ti Sable Black w/Matching Inlay",200,null,null,null,null,null,null,null,null,null,null,null,null,null,null,null,null,null,"."]
[null,null,"6Hx14 8 Lug Snare",0,null,null,"FF Full Width Wrap",null,null,null,null,null,"Left Back",null,null,null,null,null,null,null,null,null,null,null,null,null,null,null,null,null,null,null,null,null,null,"",null,null,null,"sd",0,false,0,"6Hx14 8 Lug",967,1167,0,null,"SN Satin Natural",0,null,0,{"$f":"+AZ65*DU30","v":0},"Right Back",null,null,null,null,null,null,null,null,null,null,null,null,null,null,null,null,null,0,0,0,0,0,0,0,0,null,0,null,null,null,null,null,null,null,0,null,null,null,null,null,{"$f":"SUM(CQ58:CQ64)","v":0},"Sum of Conflict Sizes",null,null,null,null,{"$f":"+CW64*CW63","v":0},"Error if > 0",null,null,{"$f":"+AO65","v":0},"6Hx14 8 Lug","64",{"$f":"IF($AZ$69=1,CONCATENATE(\"LLS4\",DC65),CONCATENATE(\"LLS3\",DC65))","v":"LLS364"},{"$error":"#N/A"},{"$f":"IF($BI$42=1,CONCATENATE(VLOOKUP(1,$DA$72:$DB$75,2,FALSE),\"D\"),CONCATENATE(VLOOKUP(1,$DA$72:$DB$75,2,FALSE),\"X\"))","v":{"$error":"#N/A"}},{"$f":"LEFT(VLOOKUP(1,$AU$3:$AW$54,3,FALSE),2)","v":{"$error":"#N/A"}},"",{"$f":"IF($BD$16=1,\"B\",\"\")","v":""}," Cstm  ",{"$f":"CONCATENATE(DE65,DF65,DG65,DH65,DI65,DJ65)","v":{"$error":"#N/A"}},true,"",null,null,null,null,null,null,"0Ni Natural w/Matching Inlay",200,null,null,null,null,null,null,null,null,null,null,null,null,null,null,null,null,null,"."]
[null,null,null,null,null,null,"FFa Full Width Accent ",null,null,null,null,null,"Right Back",null,null,null,null,null,null,null,null,null,null,null,null,null,null,null,null,null,null,null,null,null,null,null,null,null,null,null,null,null,null,null,null,null,0,null,"0Ti Sable Black w/Matching Inlay",0,null,null,{"$f":"SUM(BA62:BA65)","v":0},"Upcharge",null,null,null,null,null,null,null,null,null,null,null,null,null,null,null,null,null,null,null,null,null,null,null,null,null,null,null,null,null,null,null,null,null,null,0,null,null,{"$f":"+BG5","v":0},"Long Lugs",null,null,null,null,null,null,null,null,null,null,null,null,null,null,null,null,null,null,null,null,null,null,null,null,{"$f":"CONCATENATE(DM57,DM59,DM61,DM62,DM63,DM64,DM65)","v":""},null,null,null,null,null,"0Ta Sable Black w/Accent Inlay",200,null,null,null,null,null,null,null,null,null,null,null,null,null,null,null,null,null,"."]
[null,null,"Order Total",{"$f":"SUM(D3:D66)","v":0},null,null,"MH Matching Hoop",null,null,null,null,null,null,null,null,null,null,null,null,null,null,null,null,null,null,null,null,null,null,null,null,null,null,null,null,null,null,null,null,null,null,"Bass Drum Selected ",{"$f":"SUM(AQ3:AQ22)","v":0},null,null,null,0,null,"0Ni Natural w/Matching Inlay",0,null,null,null,null,null,null,null,null,null,null,null,null,null,null,null,null,null,null,null,null,null,null,"Lugs","Throwoff","Tone Cntrl","Butt","Die Cast",null,null,null,null,null,null,null,null,null,null,null,0,null,null,{"$f":"+CN66*CN64","v":0},"1 if 20\" and LL",null,{"$f":"+CQ65*CQ56","v":0},"Error if > 0",null,null,null,null,null,null,null,null,null,null,null,null,null,null,null,null,null,null,null,null,null,null,null,null,null,null,null,"0Na Natural w/Accent Inlay",200,null,null,null,null,null,null,null,null,null,null,null,null,null,null,null,null,null,"."]
[null,null,null,null,null,null,"0T Sable Hoop",null,null,null,null,null,null,null,null,null,null,null,null,null,null,null,null,null,null,null,null,null,null,null,null,null,null,null,null,null,null,null,null,null,null,"Floor Tom Selected",{"$f":"SUM(AQ23:AQ32)","v":0},null,null,null,0,null,"0Ta Sable Black w/Accent Inlay",0,null,null,null,null,null,null,null,null,null,null,null,null,null,null,null,null,null,null,null,null,null,null,null,null,null,null,null,null,null,null,null,null,null,null,null,null,null,null,0,null,null,null,null,null,null,null,null,null,null,null,null,null,null,null,null,null,null,null,null,null,null,null,null,null,null,null,null,null,null,null,null,null,null,"FF Full Width Wrap",50,null,null,null,null,null,null,null,null,null,null,null,null,null,null,null,null,null,"."]
[null,null,null,null,null,null,"0N Natural Hoop",null,null,null,null,null,null,null,null,null,null,null,null,null,null,null,null,null,null,null,null,null,null,null,null,null,null,null,null,null,null,null,null,null,null,"Tom Tom Selected",{"$f":"SUM(AQ33:AQ56)","v":0},null,null,null,0,null,"0Na Natural w/Accent Inlay",0,null,{"$f":"IF(SUM(AU31:AU49)>0,1,0)","v":0},"Returns a 1 if Exotic",null,null,null,null,null,null,null,null,null,null,null,null,null,null,null,null,null,null,null,null,null,null,null,null,null,null,null,null,null,null,null,null,null,null,null,null,null,null,null,null,null,{"$f":"IF(SUM(CQ67,CQ54,CQ41,CQ28)>0,1,0)","v":0},"returns a 1 if ANY error",null,null,null,null,null,null,null,null,null,null,null,null,null,null,null,null,null,null,null,null,null,null,null,null,null,null,null,"FFa Full Width Accent ",50,null,null,null,null,null,null,null,null,null,null,null,null,null,null,null,null,null,"."]
[null,null,null,null,null,null,"STa Satin Black w/Accent Inlay",null,null,null,null,null,null,null,null,null,null,null,null,null,null,null,null,null,null,null,null,null,null,null,null,null,null,null,null,null,null,null,null,null,null,"Snare Drum Selected",{"$f":"SUM(AQ57:AQ65)","v":0},null,null,null,0,null,"FF Full Width Wrap",0,null,null,null,null,null,null,null,null,null,null,null,null,null,null,null,null,null,null,null,null,null,null,null,null,null,null,null,null,null,null,null,null,null,null,null,null,null,null,null,null,null,null,null,null,null,null,null,null,null,null,null,null,null,null,null,null,null,null,null,null,null,null,null,null,null,null,null,null,null,null,null,null,null,"MH Matching Hoop",0,null,null,null,null,null,null,null,null,null,null,null,null,null,null,null,null,null,"."]
[null,null,null,null,null,null,"SNa Satin Natural w/Accent Inlay",null,null,null,null,null,null,null,null,null,null,null,null,null,null,null,null,null,null,null,null,null,null,null,null,null,null,null,null,null,null,null,null,null,null,"Selected",{"$f":"SUM(AQ67:AQ70)","v":0},null,null,null,0,null,"FFa Full Width Accent ",0,null,null,null,null,null,null,null,null,null,null,null,null,null,null,null,null,null,null,null,null,null,null,null,null,null,null,null,null,null,null,null,null,null,null,null,null,null,null,{"$f":"AU72","v":0},"returns a 1 if MH Matching hoop is chosen",null,null,null,null,null,null,null,null,null,null,null,null,null,null,"SD Lugs",null,null,"BD Lugs",null,null,"FT Lugs",null,null,"TT Lugs",null,null,null,null,null,null,null,null,null,"0T Sable Hoop",200,null,null,null,null,null,null,null,null,null,null,null,null,null,null,null,null,null,"."]
[null,null,null,null,null,null,null,null,null,null,null,null,null,null,null,null,null,null,null,null,null,null,null,null,null,null,null,null,null,null,null,null,null,null,"Basses",{"$f":"CONCATENATE(AJ3,AJ4,AJ5,AJ6,AJ7,AJ8,AJ9,AJ10,AJ11,AJ12,AJ13,AJ14,AJ15,AJ16,AJ17,AJ18,AJ19,AJ20,AJ21,AJ22)","v":""},null,null,null,null,null,null,null,null,null,null,0,null,"MH Matching Hoop",0,null,null,null,null,null,null,null,null,null,null,{"$f":"SUM(BI56:BI58)","v":0},"bd Selected",null,null,null,null,null,null,null,null,null,null,null,null,null,null,null,null,null,null,null,null,null,null,null,null,null,null,null,null,null,null,null,null,null,null,null,null,null,null,null,null,null,null,{"$f":"+BE4","v":0},"M",null,{"$f":"+BE5","v":0},"Mini",null,{"$f":"+BE6","v":0},"Mini",null,{"$f":"+BE7","v":0},"Mini",null,null,null,null,null,null,null,null,"0N Natural Hoop",200,null,null,null,null,null,null,null,null,null,null,null,null,null,null,null,null,null,"."]
[null,null,null,null,null,null,null,null,null,null,null,null,null,null,null,null,null,null,null,null,null,null,null,null,null,null,null,null,null,null,null,null,null,null,"Floors",{"$f":"CONCATENATE(AJ23,AJ24,AJ25,AJ26,AJ27,AJ28,AJ29,AJ30,AJ31,AJ32)","v":""},null,null,null,null,null,null,null,null,null,null,0,null,"0T Sable Hoop",0,null,null,null,null,null,null,null,null,null,null,{"$f":"SUM(BI60)","v":1},"tt Selected",null,null,null,null,null,null,null,null,null,null,null,null,null,null,null,null,null,null,null,null,null,null,null,null,null,null,{"$f":"IF(AND(SUM(CK38:CK58,CK60)>0,AU72>0)=TRUE,1,0)","v":0},"Returns a 1 if error",null,null,null,null,null,null,null,null,null,null,null,null,null,null,{"$f":"BH4","v":0},"X","Sm Twin",{"$f":"+BF5","v":0},"WC",null,{"$f":"+BF6","v":0},"WC",null,{"$f":"+BF7","v":0},"WC","C",null,null,null,null,null,null,null,"STa Satin Black w/Accent",0,null,null,null,null,null,null,null,null,null,null,null,null,null,null,null,null,null,"."]
[null,null,null,null,null,null,null,null,null,null,null,null,null,null,null,null,null,null,null,null,null,null,null,null,null,null,null,null,null,null,null,null,null,null,"Toms",{"$f":"CONCATENATE(AJ33,AJ34,AJ35,AJ36,AJ37,AJ38,AJ39,AJ40,AJ41,AJ42,AJ43,AJ44,AJ45,AJ46,AJ47,AJ48,AJ49,AJ50,AJ51,AJ52,AJ53,AJ54,AJ55,AJ56)","v":""},null,null,null,null,null,null,null,null,null,null,0,null,"0N Natural Hoop",0,null,null,null,null,null,{"$f":"SUM(BD56)","v":1},"bd Selected",null,null,null,null,null,null,null,null,null,null,null,null,null,null,null,null,null,null,null,null,null,null,null,null,null,null,null,null,null,null,null,{"$f":"IF(OR(CK73=1,CK35=1)=TRUE,1,0)","v":0},"Returns a 1 if ANY error",null,"T-Handles vs Keystone Claws",null,null,null,null,null,null,null,null,null,null,null,null,{"$f":"+BI4","v":0},"X","Lg Twin",{"$f":"+BG5","v":0},"WL",null,{"$f":"+BG6","v":0},"WL",null,{"$f":"+BG7","v":0},"WL","L",null,null,null,null,null,null,null,"SNa Satin Natural w/Accent",0,null,null,null,null,null,null,null,null,null,null,null,null,null,null,null,null,null,"."]
[null,null,null,null,null,null,null,null,null,null,null,null,null,null,null,null,null,null,null,null,null,null,null,null,null,null,null,null,null,null,null,null,null,null,"Snares",{"$f":"CONCATENATE(AJ57,AJ58,AJ59,AJ60,AJ61,AJ62,AJ63,AJ64,AJ65)","v":""},null,null,null,null,null,null,null,null,null,null,0,null,"STa Satin Black w/Accent Inlay",0,null,null,null,null,null,{"$f":"SUM(BD58:BD60)","v":0},"tt Selected",null,null,null,null,null,null,null,null,null,null,null,null,null,null,null,null,null,null,null,null,null,null,null,null,null,null,null,null,null,null,null,null,null,null,{"$f":"BD11","v":0},"T-Handles",null,null,null,null,null,null,null,null,null,null,null,{"$f":"+BJ4","v":0},"T",null,null,null,null,null,null,null,null,null,null,null,null,null,null,null,null,null,null,null,null,null,null,null,null,null,null,null,null,null,null,null,null,null,null,null,null,"."]
[null,null,null,null,null,null,null,null,null,null,null,null,null,null,null,null,null,null,null,null,null,null,null,null,null,null,null,null,null,null,null,null,null,null,null,null,null,null,null,null,null,null,null,null,null,null,0,null,"SNa Satin Natural w/Accent Inlay",0,null,null,null,null,null,{"$f":"SUM(BD62:BD63)","v":0},"sd Selected",null,null,null,null,null,null,null,null,null,null,null,null,null,null,null,null,null,null,null,null,null,null,null,null,null,null,null,null,null,null,null,"Dynamic Default for Bass Hoops",null,null,{"$f":"BH12","v":0},"Keystone Claws",null,null,null,null,null,null,null,null,null,null,null,null,null,null,null,null,null,null,null,null,null,null,null,null,null,null,null,null,null,null,null,null,null,null,null,null,null,null,null,null,null,null,null,null,null,null,null,null,null,"."]
[null,null,"rev 4/25/16",null,null,null,null,null,null,null,null,null,null,null,null,null,null,null,null,null,null,null,null,null,null,null,null,null,null,null,null,null,null,null,null,null,null,null,null,null,null,null,null,null,null,null,{"$f":"SUM(AU62:AU76)","v":0},null,"Selected    /    Upcharge",{"$f":"SUM(AX62:AX76)","v":0},null,null,null,null,null,null,null,null,null,null,null,null,null,null,null,null,null,null,null,null,null,null,null,null,null,null,null,null,null,null,null,null,null,null,null,null,null,null,{"$f":"+AU3","v":0},"0C Champagne Sparkle",null,{"$f":"+CN76*CN75","v":0},"error if > 0",null,null,null,null,null,null,null,null,null,null,null,null,null,null,null,null,null,null,null,null,null,null,null,null,null,null,null,null,null,null,null,null,null,null,null,null,null,null,null,null,null,null,null,null,null,null,null,null,null,"."]
[null,null,null,null,null,null,null,null,null,null,null,null,null,null,null,null,null,null,null,null,null,null,null,null,null,null,null,null,null,null,null,null,null,null,null,null,null,null,null,null,null,null,null,null,null,null,null,null,null,null,null,null,null,null,null,null,null,null,null,null,null,null,null,null,null,null,null,null,null,null,null,null,null,null,null,null,null,null,null,null,null,null,null,null,null,null,null,null,{"$f":"+AU10","v":0},"88 Indigo Sparkle",null,null,null,null,null,null,null,null,null,null,null,null,null,null,null,null,null,null,null,null,null,null,null,null,null,null,null,null,null,null,null,null,null,null,null,null,null,null,null,null,null,null,null,null,null,null,null,null,null,null,null,null,"."]
[null,null,null,null,null,null,null,null,null,null,null,null,null,null,null,null,null,null,null,null,null,null,null,null,null,null,null,null,null,null,null,null,null,null,null,null,null,null,null,null,null,null,null,null,null,null,null,null,null,"Badge",null,null,null,null,null,null,null,null,null,null,null,null,null,null,null,null,null,null,null,null,null,null,null,null,null,null,null,null,null,null,null,null,null,null,null,null,null,null,null,null,null,null,null,null,null,null,null,null,null,null,null,null,null,null,null,null,null,null,null,null,null,null,null,null,null,null,null,null,null,null,null,null,null,null,null,null,null,null,null,null,null,null,null,null,null,null,null,null,null,null,null,null,"."]
[null,null,null,null,null,null,null,null,null,null,null,null,null,null,null,null,null,null,null,null,null,null,null,null,null,null,null,null,null,null,null,null,null,null,null,null,null,null,null,null,null,null,null,null,null,null,null,null,null,{"$f":"IF(J43=\"\",0,1)","v":0},{"$f":"DU55*AX80","v":0},"GC Cast Brass Badge",null,null,null,null,null,null,null,null,null,null,null,null,null,null,null,null,null,null,null,null,null,null,null,null,null,null,null,null,null,null,{"$f":"+CE64+CE46+CE29+CE17","v":0},null,null,{"$f":"+CH60","v":0},null,null,{"$f":"+CK74","v":0},null,null,{"$f":"+CN55+CN48+CN36+CN29+CN21+CN13+CN67+CN77","v":0},null,null,{"$f":"+CQ69+CQ16","v":0},null,null,{"$f":"+CT58+CT51+CT27+CT12","v":0},null,null,{"$f":"+CW34+CW16+CW52+CW65","v":0},null,{"$f":"SUM(CE80:CX80)","v":0},"Any Error WHATSOEVER",null,null,null,null,null,null,null,null,null,null,null,null,null,null,null,null,null,null,null,null,null,null,null,null,null,null,null,null,null,null,null,null,null,null,null,null,null,null,"."]
[null,null,null,null,null,null,null,null,null,null,null,null,null,null,null,null,null,null,null,null,null,null,null,null,null,null,null,null,null,null,null,null,null,null,null,null,null,null,null,null,null,null,null,null,null,null,null,null,null,{"$f":"IF(J44=\"\",0,1)","v":0},{"$f":"DU56*AX81","v":0},"BO Blue/Olive",null,null,null,null,null,null,null,null,null,null,null,null,null,null,null,null,null,null,null,null,null,null,null,null,null,null,null,null,null,null,"Any Error",null,null,"Any Error",null,null,"Any Error",null,null,"Any Error",null,null,"Any Error",null,null,"Any Error",null,null,"Any Error",null,null,null,null,null,null,null,null,null,null,null,null,null,null,null,null,null,null,null,null,null,null,null,null,null,null,null,null,null,null,null,null,null,null,null,null,null,null,null,null,null,"."]
[null,null,null,null,null,null,null,null,null,null,null,null,null,null,null,null,null,null,null,null,null,null,null,null,null,null,null,null,null,null,null,null,null,null,null,null,null,null,null,null,null,null,null,null,null,null,null,null,null,{"$f":"IF(J45=\"\",0,1)","v":0},{"$f":"DU57*AX82","v":0},"SGK Small Legacy Keystone",null,null,null,null,null,null,null,null,null,null,null,null,null,null,null,null,null,null,null,null,null,null,null,null,null,null,null,null,null,null,null,null,null,null,null,null,null,null,null,null,null,null,null,null,null,null,null,null,null,null,null,null,null,null,null,null,null,null,null,null,null,null,null,null,null,null,null,null,null,null,null,null,null,null,null,null,null,null,null,null,null,null,null,null,null,null,null,null,null,null,"."]
[null,null,null,null,null,null,null,null,null,null,null,null,null,null,null,null,null,null,null,null,null,null,null,null,null,null,null,null,null,null,null,null,null,null,null,null,null,null,null,null,null,null,null,null,null,null,null,null,null,null,null,null,null,null,null,null,null,null,null,null,null,null,null,null,null,null,null,null,null,null,null,null,null,null,null,null,null,null,null,null,null,null,null,null,null,null,null,null,null,null,null,null,null,null,null,null,null,null,null,null,null,null,null,null,null,null,null,null,null,null,null,null,null,null,null,null,null,null,null,null,null,null,null,null,null,null,null,null,null,null,null,null,null,null,null,null,null,null,null,null,null,null,"."]
[null,null,null,null,null,null,null,null,null,null,null,null,null,null,null,null,null,null,null,null,null,null,null,null,null,null,null,null,null,null,null,null,null,null,null,null,null,null,null,null,null,null,null,null,null,null,null,null,null,null,null,null,null,null,null,null,null,null,null,null,null,null,null,null,null,null,null,null,null,null,null,null,null,null,null,null,null,null,null,null,null,null,null,null,null,null,null,null,null,null,null,null,null,null,null,null,null,null,null,null,null,null,null,null,null,null,null,null,null,null,null,null,null,null,null,null,null,null,null,null,null,null,null,null,null,null,null,null,null,null,null,null,null,null,null,null,null,null,null,null,null,null,"."]
[null,null,null,null,null,null,null,null,null,null,null,null,null,null,null,null,null,null,null,null,null,null,null,null,null,null,null,null,null,null,null,null,null,null,null,null,null,null,null,null,null,null,null,null,null,null,null,null,null,null,null,null,null,null,null,null,null,null,null,null,null,null,null,null,null,null,null,null,null,null,null,null,null,null,null,null,null,null,null,null,null,null,null,null,null,null,null,null,null,null,null,null,null,null,null,null,null,null,null,null,null,null,null,null,null,null,null,null,null,null,null,null,null,null,null,null,null,null,null,null,null,null,null,null,null,null,null,null,null,null,null,null,null,null,null,null,null,null,null,null,null,null,"."]
[null,null,null,null,null,null,null,null,null,null,null,null,null,null,null,null,null,null,null,null,null,null,null,null,null,null,null,null,null,null,null,null,null,null,null,null,null,null,null,null,null,null,null,null,null,null,null,null,null,{"$f":"SUM(AX80:AX85)","v":0},{"$f":"SUM(AY80:AY85)","v":0},"Badge Upcharge",null,null,null,null,null,null,null,null,null,null,null,null,null,null,null,null,null,null,null,null,null,null,null,null,null,null,null,null,null,null,null,null,null,null,null,null,"SP ShamPayne",null,null,null,null,null,null,null,null,null,null,null,null,null,null,null,null,null,null,null,null,null,null,null,null,null,null,null,null,null,null,null,null,null,null,null,null,null,null,null,null,null,null,null,null,null,null,null,null,null,null,null,null,null,"."]
[null,null,null,null,null,null,null,null,null,null,null,null,null,null,null,null,null,null,null,null,null,null,null,null,null,null,null,null,null,null,null,null,null,null,null,null,null,null,null,null,null,null,null,null,null,null,null,null,null,null,null,null,null,null,null,null,null,null,null,null,null,null,null,null,null,null,null,null,null,null,null,null,null,null,null,null,null,null,null,null,null,null,null,null,null,null,null,null,"GM Gunmetal",null,null,null,null,null,null,null,null,null,null,null,null,null,null,null,null,null,null,null,null,null,null,null,null,null,null,null,null,null,null,null,null,null,null,null,null,null,null,null,null,null,null,null,null,null,null,null,null,null,null,null,null,null,"."]
[null,null,null,null,null,null,null,null,null,null,null,null,null,null,null,null,null,null,null,null,null,null,null,null,null,null,null,null,null,null,null,null,null,null,null,null,null,null,null,null,null,null,null,null,null,null,null,null,null,null,null,null,null,null,null,null,null,null,null,null,null,null,null,null,null,null,null,null,null,null,null,null,null,null,null,null,null,null,null,null,null,null,null,null,null,null,null,null,"AG Apple Glass",null,null,null,null,null,null,null,null,null,null,null,null,null,null,null,null,null,null,null,null,null,null,null,null,null,null,null,null,null,null,null,null,null,null,null,null,null,null,null,null,null,null,null,null,null,null,null,null,null,null,null,null,null,"."]
[null,null,null,null,null,null,null,null,null,null,null,null,null,null,null,null,null,null,null,null,null,null,null,null,null,null,null,null,null,null,null,null,null,null,null,null,null,null,null,null,null,null,null,null,null,null,null,null,null,null,null,null,null,null,null,null,null,null,null,null,null,null,null,null,null,null,null,null,null,null,null,null,null,null,null,null,null,null,null,null,null,null,null,null,null,null,null,null,"GB Galaxy Bronze",null,null,null,null,null,null,null,null,null,null,null,null,null,null,null,null,null,null,null,null,null,null,null,null,null,null,null,null,null,null,null,null,null,null,null,null,null,null,null,null,null,null,null,null,null,null,null,null,null,null,null,null,null,"."]
[null,null,null,null,null,null,null,null,null,null,null,null,null,null,null,null,null,null,null,null,null,null,null,null,null,null,null,null,null,null,null,null,null,null,null,null,null,null,null,null,null,null,null,null,null,null,null,null,null,null,null,null,null,null,null,null,null,null,null,null,null,null,null,null,null,null,null,null,null,null,null,null,null,null,null,null,null,null,null,null,null,null,null,null,null,null,null,null,"TQ Turquoyster",null,null,null,null,null,null,null,null,null,null,null,null,null,null,null,null,null,null,null,null,null,null,null,null,null,null,null,null,null,null,null,null,null,null,null,null,null,null,null,null,null,null,null,null,null,null,null,null,null,null,null,null,null,"."]
[null,null,null,null,null,null,null,null,null,null,null,null,null,null,null,null,null,null,null,null,null,null,null,null,null,null,null,null,null,null,null,null,null,null,null,null,null,null,null,null,null,null,null,null,null,null,null,null,null,null,null,null,null,null,null,null,null,null,null,null,null,null,null,null,null,null,null,null,null,null,null,null,null,null,null,null,null,null,null,null,null,null,null,null,null,null,null,null,"SO Salmon Pearl",null,null,null,null,null,null,null,null,null,null,null,null,null,null,null,null,null,null,null,null,null,null,null,null,null,null,null,null,null,null,null,null,null,null,null,null,null,null,null,null,null,null,null,null,null,null,null,null,null,null,null,null,null,"."]
[null,null,null,null,null,null,null,null,null,null,null,null,null,null,null,null,null,null,null,null,null,null,null,null,null,null,null,null,null,null,null,null,null,null,null,null,null,null,null,null,null,null,null,null,null,null,null,null,null,null,null,null,null,null,null,null,null,null,null,null,null,null,null,null,null,null,null,null,null,null,null,null,null,null,null,null,null,null,null,null,null,null,null,null,null,null,null,null,"RP Red Oyster",null,null,null,null,null,null,null,null,null,null,null,null,null,null,null,null,null,null,null,null,null,null,null,null,null,null,null,null,null,null,null,null,null,null,null,null,null,null,null,null,null,null,null,null,null,null,null,null,null,null,null,null,null,"."]
[null,null,null,null,null,null,null,null,null,null,null,null,null,null,null,null,null,null,null,null,null,null,null,null,null,null,null,null,null,null,null,null,null,null,null,null,null,null,null,null,null,null,null,null,null,null,null,null,null,null,null,null,null,null,null,null,null,null,null,null,null,null,null,null,null,null,null,null,null,null,null,null,null,null,null,null,null,null,null,null,null,null,null,null,null,null,null,null,null,null,null,null,null,null,null,null,null,null,null,null,null,null,null,null,null,null,null,null,null,null,null,null,null,null,null,null,null,null,null,null,null,null,null,null,null,null,null,null,null,null,null,null,null,null,null,null,null,null,null,null,null,null,"."]
[null,null,null,null,null,null,null,null,null,null,null,null,null,null,null,null,null,null,null,null,null,null,null,null,null,null,null,null,null,null,null,null,null,null,null,null,null,null,null,null,null,null,null,null,null,null,null,null,null,null,null,null,null,null,null,null,null,null,null,null,null,null,null,null,null,null,null,null,null,null,null,null,null,null,null,null,null,null,null,null,null,null,null,null,null,null,null,null,null,null,null,null,null,null,null,null,null,null,null,null,null,null,null,null,null,null,null,null,null,null,null,null,null,null,null,null,null,null,null,null,null,null,null,null,null,null,null,null,null,null,null,null,null,null,null,null,null,null,null,null,null,null,"."]
[null,null,null,null,null,null,null,null,null,null,null,null,null,null,null,null,null,null,null,null,null,null,null,null,null,null,null,null,null,null,null,null,null,null,null,null,null,null,null,null,null,null,null,null,null,null,null,null,null,null,null,null,null,null,null,null,null,null,null,null,null,null,null,null,null,null,null,null,null,null,null,null,null,null,null,null,null,null,null,null,null,null,null,null,null,null,null,null,null,null,null,null,null,null,null,null,null,null,null,null,null,null,null,null,null,null,null,null,null,null,null,null,null,null,null,null,null,null,null,null,null,null,null,null,null,null,null,null,null,null,null,null,null,null,null,null,null,null,null,null,null,null,"."]
[null,null,null,null,null,null,null,null,null,null,null,null,null,null,null,null,null,null,null,null,null,null,null,null,null,null,null,null,null,null,null,null,null,null,null,null,null,null,null,null,null,null,null,null,null,null,null,null,null,null,null,null,null,null,null,null,null,null,null,null,null,null,null,null,null,null,null,null,null,null,null,null,null,null,null,null,null,null,null,null,null,null,null,null,null,null,null,null,null,null,null,null,null,null,null,null,null,null,null,null,null,null,null,null,null,null,null,null,null,null,null,null,null,null,null,null,null,null,null,null,null,null,null,null,null,null,null,null,null,null,null,null,null,null,null,null,null,null,null,null,null,null,"."]
[null,null,null,null,null,null,null,null,null,null,null,null,null,null,null,null,null,null,null,null,null,null,null,null,null,null,null,null,null,null,null,null,null,null,null,null,null,null,null,null,null,null,null,null,null,null,null,null,null,null,null,null,null,null,null,null,null,null,null,null,null,null,null,null,null,null,null,null,null,null,null,null,null,null,null,null,null,null,null,null,null,null,null,null,null,null,null,null,null,null,null,null,null,null,null,null,null,null,null,null,null,null,null,null,null,null,null,null,null,null,null,null,null,null,null,null,null,null,null,null,null,null,null,null,null,null,null,null,null,null,null,null,null,null,null,null,null,null,null,null,null,null,"."]
[null,null,null,null,null,null,null,null,null,null,null,null,null,null,null,null,null,null,null,null,null,null,null,null,null,null,null,null,null,null,null,null,null,null,null,null,null,null,null,null,null,null,null,null,null,null,null,null,null,null,null,null,null,null,null,null,null,null,null,null,null,null,null,null,null,null,null,null,null,null,null,null,null,null,null,null,null,null,null,null,null,null,null,null,null,null,null,null,null,null,null,null,null,null,null,null,null,null,null,null,null,null,null,null,null,null,null,null,null,null,null,null,null,null,null,null,null,null,null,null,null,null,null,null,null,null,null,null,null,null,null,null,null,null,null,null,null,null,null,null,null,null,"."]
[null,null,null,null,null,null,null,null,null,null,null,null,null,null,null,null,null,null,null,null,null,null,null,null,null,null,null,null,null,null,null,null,null,null,null,null,null,null,null,null,null,null,null,null,null,null,null,null,null,null,null,null,null,null,null,null,null,null,null,null,null,null,null,null,null,null,null,null,null,null,null,null,null,null,null,null,null,null,null,null,null,null,null,null,null,null,null,null,null,null,null,null,null,null,null,null,null,null,null,null,null,null,null,null,null,null,null,null,null,null,null,null,null,null,null,null,null,null,null,null,null,null,null,null,null,null,null,null,null,null,null,null,null,null,null,null,null,null,null,null,null,null,"."]
[null,null,null,null,null,null,null,null,null,null,null,null,null,null,null,null,null,null,null,null,null,null,null,null,null,null,null,null,null,null,null,null,null,null,null,null,null,null,null,null,null,null,null,null,null,null,null,null,null,null,null,null,null,null,null,null,null,null,null,null,null,null,null,null,null,null,null,null,null,null,null,null,null,null,null,null,null,null,null,null,null,null,null,null,null,null,null,null,null,null,null,null,null,null,null,null,null,null,null,null,null,null,null,null,null,null,null,null,null,null,null,null,null,null,null,null,null,null,null,null,null,null,null,null,null,null,null,null,null,null,null,null,null,null,null,null,null,null,null,null,null,null,"."]
[null,null,null,null,null,null,null,null,null,null,null,null,null,null,null,null,null,null,null,null,null,null,null,null,null,null,null,null,null,null,null,null,null,null,null,null,null,null,null,null,null,null,null,null,null,null,null,null,null,null,null,null,null,null,null,null,null,null,null,null,null,null,null,null,null,null,null,null,null,null,null,null,null,null,null,null,null,null,null,null,null,null,null,null,null,null,null,null,null,null,null,null,null,null,null,null,null,null,null,null,null,null,null,null,null,null,null,null,null,null,null,null,null,null,null,null,null,null,null,null,null,null,null,null,null,null,null,null,null,null,null,null,null,null,null,null,null,null,null,null,null,null,"."]
[null,null,null,null,null,null,null,null,null,null,null,null,null,null,null,null,null,null,null,null,null,null,null,null,null,null,null,null,null,null,null,null,null,null,null,null,null,null,null,null,null,null,null,null,null,null,null,null,null,null,null,null,null,null,null,null,null,null,null,null,null,null,null,null,null,null,null,null,null,null,null,null,null,null,null,null,null,null,null,null,null,null,null,null,null,null,null,null,null,null,null,null,null,null,null,null,null,null,null,null,null,null,null,null,null,null,null,null,null,null,null,null,null,null,null,null,null,null,null,null,null,null,null,null,null,null,null,null,null,null,null,null,null,null,null,null,null,null,null,null,null,null,"."]
[null,null,null,null,null,null,null,null,null,null,null,null,null,null,null,null,null,null,null,null,null,null,null,null,null,null,null,null,null,null,null,null,null,null,null,null,null,null,null,null,null,null,null,null,null,null,null,null,null,null,null,null,null,null,null,null,null,null,null,null,null,null,null,null,null,null,null,null,null,null,null,null,null,null,null,null,null,null,null,null,null,null,null,null,null,null,null,null,null,null,null,null,null,null,null,null,null,null,null,null,null,null,null,null,null,null,null,null,null,null,null,null,null,null,null,null,null,null,null,null,null,null,null,null,null,null,null,null,null,null,null,null,null,null,null,null,null,null,null,null,null,null,"."]
[null,null,null,null,null,null,null,null,null,null,null,null,null,null,null,null,null,null,null,null,null,null,null,null,null,null,null,null,null,null,null,null,null,null,null,null,null,null,null,null,null,null,null,null,null,null,null,null,null,null,null,null,null,null,null,null,null,null,null,null,null,null,null,null,null,null,null,null,null,null,null,null,null,null,null,null,null,null,null,null,null,null,null,null,null,null,null,null,null,null,null,null,null,null,null,null,null,null,null,null,null,null,null,null,null,null,null,null,null,null,null,null,null,null,null,null,null,null,null,null,null,null,null,null,null,null,null,null,null,null,null,null,null,null,null,null,null,null,null,null,null,null,"."]
[null,null,null,null,null,null,null,null,null,null,null,null,null,null,null,null,null,null,null,null,null,null,null,null,null,null,null,null,null,null,null,null,null,null,null,null,null,null,null,null,null,null,null,null,null,null,null,null,null,null,null,null,null,null,null,null,null,null,null,null,null,null,null,null,null,null,null,null,null,null,null,null,null,null,null,null,null,null,null,null,null,null,null,null,null,null,null,null,null,null,null,null,null,null,null,null,null,null,null,null,null,null,null,null,null,null,null,null,null,null,null,null,null,null,null,null,null,null,null,null,null,null,null,null,null,null,null,null,null,null,null,null,null,null,null,null,null,null,null,null,null,null,"."]
[null,null,null,null,null,null,null,null,null,null,null,null,null,null,null,null,null,null,null,null,null,null,null,null,null,null,null,null,null,null,null,null,null,null,null,null,null,null,null,null,null,null,null,null,null,null,null,null,null,null,null,null,null,null,null,null,null,null,null,null,null,null,null,null,null,null,null,null,null,null,null,null,null,null,null,null,null,null,null,null,null,null,null,null,null,null,null,null,null,null,null,null,null,null,null,null,null,null,null,null,null,null,null,null,null,null,null,null,null,null,null,null,null,null,null,null,null,null,null,null,null,null,null,null,null,null,null,null,null,null,null,null,null,null,null,null,null,null,null,null,null,null,"."]
[null,null,null,null,null,null,null,null,null,null,null,null,null,null,null,null,null,null,null,null,null,null,null,null,null,null,null,null,null,null,null,null,null,null,null,null,null,null,null,null,null,null,null,null,null,null,null,null,null,null,null,null,null,null,null,null,null,null,null,null,null,null,null,null,null,null,null,null,null,null,null,null,null,null,null,null,null,null,null,null,null,null,null,null,null,null,null,null,null,null,null,null,null,null,null,null,null,null,null,null,null,null,null,null,null,null,null,null,null,null,null,null,null,null,null,null,null,null,null,null,null,null,null,null,null,null,null,null,null,null,null,null,null,null,null,null,null,null,null,null,null,null,"."]
[null,null,null,null,null,null,null,null,null,null,null,null,null,null,null,null,null,null,null,null,null,null,null,null,null,null,null,null,null,null,null,null,null,null,null,null,null,null,null,null,null,null,null,null,null,null,null,null,null,null,null,null,null,null,null,null,null,null,null,null,null,null,null,null,null,null,null,null,null,null,null,null,null,null,null,null,null,null,null,null,null,null,null,null,null,null,null,null,null,null,null,null,null,null,null,null,null,null,null,null,null,null,null,null,null,null,null,null,null,null,null,null,null,null,null,null,null,null,null,null,null,null,null,null,null,null,null,null,null,null,null,null,null,null,null,null,null,null,null,null,null,null,"."]
[null,null,null,null,null,null,null,null,null,null,null,null,null,null,null,null,null,null,null,null,null,null,null,null,null,null,null,null,null,null,null,null,null,null,null,null,null,null,null,null,null,null,null,null,null,null,null,null,null,null,null,null,null,null,null,null,null,null,null,null,null,null,null,null,null,null,null,null,null,null,null,null,null,null,null,null,null,null,null,null,null,null,null,null,null,null,null,null,null,null,null,null,null,null,null,null,null,null,null,null,null,null,null,null,null,null,null,null,null,null,null,null,null,null,null,null,null,null,null,null,null,null,null,null,null,null,null,null,null,null,null,null,null,null,null,null,null,null,null,null,null,null,"."]
[null,null,null,null,null,null,null,null,null,null,null,null,null,null,null,null,null,null,null,null,null,null,null,null,null,null,null,null,null,null,null,null,null,null,null,null,null,null,null,null,null,null,null,null,null,null,null,null,null,null,null,null,null,null,null,null,null,null,null,null,null,null,null,null,null,null,null,null,null,null,null,null,null,null,null,null,null,null,null,null,null,null,null,null,null,null,null,null,null,null,null,null,null,null,null,null,null,null,null,null,null,null,null,null,null,null,null,null,null,null,null,null,null,null,null,null,null,null,null,null,null,null,null,null,null,null,null,null,null,null,null,null,null,null,null,null,null,null,null,null,null,null,"."]
[null,null,null,null,null,null,null,null,null,null,null,null,null,null,null,null,null,null,null,null,null,null,null,null,null,null,null,null,null,null,null,null,null,null,null,null,null,null,null,null,null,null,null,null,null,null,null,null,null,null,null,null,null,null,null,null,null,null,null,null,null,null,null,null,null,null,null,null,null,null,null,null,null,null,null,null,null,null,null,null,null,null,null,null,null,null,null,null,null,null,null,null,null,null,null,null,null,null,null,null,null,null,null,null,null,null,null,null,null,null,null,null,null,null,null,null,null,null,null,null,null,null,null,null,null,null,null,null,null,null,null,null,null,null,null,null,null,null,null,null,null,null,"."]
[null,null,null,null,null,null,null,null,null,null,null,null,null,null,null,null,null,null,null,null,null,null,null,null,null,null,null,null,null,null,null,null,null,null,null,null,null,null,null,null,null,null,null,null,null,null,null,null,null,null,null,null,null,null,null,null,null,null,null,null,null,null,null,null,null,null,null,null,null,null,null,null,null,null,null,null,null,null,null,null,null,null,null,null,null,null,null,null,null,null,null,null,null,null,null,null,null,null,null,null,null,null,null,null,null,null,null,null,null,null,null,null,null,null,null,null,null,null,null,null,null,null,null,null,null,null,null,null,null,null,null,null,null,null,null,null,null,null,null,null,null,null,"."]
[null,null,null,null,null,null,null,null,null,null,null,null,null,null,null,null,null,null,null,null,null,null,null,null,null,null,null,null,null,null,null,null,null,null,null,null,null,null,null,null,null,null,null,null,null,null,null,null,null,null,null,null,null,null,null,null,null,null,null,null,null,null,null,null,null,null,null,null,null,null,null,null,null,null,null,null,null,null,null,null,null,null,null,null,null,null,null,null,null,null,null,null,null,null,null,null,null,null,null,null,null,null,null,null,null,null,null,null,null,null,null,null,null,null,null,null,null,null,null,null,null,null,null,null,null,null,null,null,null,null,null,null,null,null,null,null,null,null,null,null,null,null,"."]
[null,null,null,null,null,null,null,null,null,null,null,null,null,null,null,null,null,null,null,null,null,null,null,null,null,null,null,null,null,null,null,null,null,null,null,null,null,null,null,null,null,null,null,null,null,null,null,null,null,null,null,null,null,null,null,null,null,null,null,null,null,null,null,null,null,null,null,null,null,null,null,null,null,null,null,null,null,null,null,null,null,null,null,null,null,null,null,null,null,null,null,null,null,null,null,null,null,null,null,null,null,null,null,null,null,null,null,null,null,null,null,null,null,null,null,null,null,null,null,null,null,null,null,null,null,null,null,null,null,null,null,null,null,null,null,null,null,null,null,null,null,null,"."]
[null,null,null,null,null,null,null,null,null,null,null,null,null,null,null,null,null,null,null,null,null,null,null,null,null,null,null,null,null,null,null,null,null,null,null,null,null,null,null,null,null,null,null,null,null,null,null,null,null,null,null,null,null,null,null,null,null,null,null,null,null,null,null,null,null,null,null,null,null,null,null,null,null,null,null,null,null,null,null,null,null,null,null,null,null,null,null,null,null,null,null,null,null,null,null,null,null,null,null,null,null,null,null,null,null,null,null,null,null,null,null,null,null,null,null,null,null,null,null,null,null,null,null,null,null,null,null,null,null,null,null,null,null,null,null,null,null,null,null,null,null,null,"."]
[null,null,null,null,null,null,null,null,null,null,null,null,null,null,null,null,null,null,null,null,null,null,null,null,null,null,null,null,null,null,null,null,null,null,null,null,null,null,null,null,null,null,null,null,null,null,null,null,null,null,null,null,null,null,null,null,null,null,null,null,null,null,null,null,null,null,null,null,null,null,null,null,null,null,null,null,null,null,null,null,null,null,null,null,null,null,null,null,null,null,null,null,null,null,null,null,null,null,null,null,null,null,null,null,null,null,null,null,null,null,null,null,null,null,null,null,null,null,null,null,null,null,null,null,null,null,null,null,null,null,null,null,null,null,null,null,null,null,null,null,null,null,"."]
[null,null,null,null,null,null,null,null,null,null,null,null,null,null,null,null,null,null,null,null,null,null,null,null,null,null,null,null,null,null,null,null,null,null,null,null,null,null,null,null,null,null,null,null,null,null,null,null,null,null,null,null,null,null,null,null,null,null,null,null,null,null,null,null,null,null,null,null,null,null,null,null,null,null,null,null,null,null,null,null,null,null,null,null,null,null,null,null,null,null,null,null,null,null,null,null,null,null,null,null,null,null,null,null,null,null,null,null,null,null,null,null,null,null,null,null,null,null,null,null,null,null,null,null,null,null,null,null,null,null,null,null,null,null,null,null,null,null,null,null,null,null,"."]
[null,null,null,null,null,null,null,null,null,null,null,null,null,null,null,null,null,null,null,null,null,null,null,null,null,null,null,null,null,null,null,null,null,null,null,null,null,null,null,null,null,null,null,null,null,null,null,null,null,null,null,null,null,null,null,null,null,null,null,null,null,null,null,null,null,null,null,null,null,null,null,null,null,null,null,null,null,null,null,null,null,null,null,null,null,null,null,null,null,null,null,null,null,null,null,null,null,null,null,null,null,null,null,null,null,null,null,null,null,null,null,null,null,null,null,null,null,null,null,null,null,null,null,null,null,null,null,null,null,null,null,null,null,null,null,null,null,null,null,null,null,null,"."]
[null,null,null,null,null,null,null,null,null,null,null,null,null,null,null,null,null,null,null,null,null,null,null,null,null,null,null,null,null,null,null,null,null,null,null,null,null,null,null,null,null,null,null,null,null,null,null,null,null,null,null,null,null,null,null,null,null,null,null,null,null,null,null,null,null,null,null,null,null,null,null,null,null,null,null,null,null,null,null,null,null,null,null,null,null,null,null,null,null,null,null,null,null,null,null,null,null,null,null,null,null,null,null,null,null,null,null,null,null,null,null,null,null,null,null,null,null,null,null,null,null,null,null,null,null,null,null,null,null,null,null,null,null,null,null,null,null,null,null,null,null,null,"."]
[null,null,null,null,null,null,null,null,null,null,null,null,null,null,null,null,null,null,null,null,null,null,null,null,null,null,null,null,null,null,null,null,null,null,null,null,null,null,null,null,null,null,null,null,null,null,null,null,null,null,null,null,null,null,null,null,null,null,null,null,null,null,null,null,null,null,null,null,null,null,null,null,null,null,null,null,null,null,null,null,null,null,null,null,null,null,null,null,null,null,null,null,null,null,null,null,null,null,null,null,null,null,null,null,null,null,null,null,null,null,null,null,null,null,null,null,null,null,null,null,null,null,null,null,null,null,null,null,null,null,null,null,null,null,null,null,null,null,null,null,null,null,"."]
[null,null,null,null,null,null,null,null,null,null,null,null,null,null,null,null,null,null,null,null,null,null,null,null,null,null,null,null,null,null,null,null,null,null,null,null,null,null,null,null,null,null,null,null,null,null,null,null,null,null,null,null,null,null,null,null,null,null,null,null,null,null,null,null,null,null,null,null,null,null,null,null,null,null,null,null,null,null,null,null,null,null,null,null,null,null,null,null,null,null,null,null,null,null,null,null,null,null,null,null,null,null,null,null,null,null,null,null,null,null,null,null,null,null,null,null,null,null,null,null,null,null,null,null,null,null,null,null,null,null,null,null,null,null,null,null,null,null,null,null,null,null,"."]
[null,null,null,null,null,null,null,null,null,null,null,null,null,null,null,null,null,null,null,null,null,null,null,null,null,null,null,null,null,null,null,null,null,null,null,null,null,null,null,null,null,null,null,null,null,null,null,null,null,null,null,null,null,null,null,null,null,null,null,null,null,null,null,null,null,null,null,null,null,null,null,null,null,null,null,null,null,null,null,null,null,null,null,null,null,null,null,null,null,null,null,null,null,null,null,null,null,null,null,null,null,null,null,null,null,null,null,null,null,null,null,null,null,null,null,null,null,null,null,null,null,null,null,null,null,null,null,null,null,null,null,null,null,null,null,null,null,null,null,null,null,null,"."]
[null,null,null,null,null,null,null,null,null,null,null,null,null,null,null,null,null,null,null,null,null,null,null,null,null,null,null,null,null,null,null,null,null,null,null,null,null,null,null,null,null,null,null,null,null,null,null,null,null,null,null,null,null,null,null,null,null,null,null,null,null,null,null,null,null,null,null,null,null,null,null,null,null,null,null,null,null,null,null,null,null,null,null,null,null,null,null,null,null,null,null,null,null,null,null,null,null,null,null,null,null,null,null,null,null,null,null,null,null,null,null,null,null,null,null,null,null,null,null,null,null,null,null,null,null,null,null,null,null,null,null,null,null,null,null,null,null,null,null,null,null,null,"."]
[null,null,null,null,null,null,null,null,null,null,null,null,null,null,null,null,null,null,null,null,null,null,null,null,null,null,null,null,null,null,null,null,null,null,null,null,null,null,null,null,null,null,null,null,null,null,null,null,null,null,null,null,null,null,null,null,null,null,null,null,null,null,null,null,null,null,null,null,null,null,null,null,null,null,null,null,null,null,null,null,null,null,null,null,null,null,null,null,null,null,null,null,null,null,null,null,null,null,null,null,null,null,null,null,null,null,null,null,null,null,null,null,null,null,null,null,null,null,null,null,null,null,null,null,null,null,null,null,null,null,null,null,null,null,null,null,null,null,null,null,null,null,"."]
[null,null,null,null,null,null,null,null,null,null,null,null,null,null,null,null,null,null,null,null,null,null,null,null,null,null,null,null,null,null,null,null,null,null,null,null,null,null,null,null,null,null,null,null,null,null,null,null,null,null,null,null,null,null,null,null,null,null,null,null,null,null,null,null,null,null,null,null,null,null,null,null,null,null,null,null,null,null,null,null,null,null,null,null,null,null,null,null,null,null,null,null,null,null,null,null,null,null,null,null,null,null,null,null,null,null,null,null,null,null,null,null,null,null,null,null,null,null,null,null,null,null,null,null,null,null,null,null,null,null,null,null,null,null,null,null,null,null,null,null,null,null,"."]
[null,null,null,null,null,null,null,null,null,null,null,null,null,null,null,null,null,null,null,null,null,null,null,null,null,null,null,null,null,null,null,null,null,null,null,null,null,null,null,null,null,null,null,null,null,null,null,null,null,null,null,null,null,null,null,null,null,null,null,null,null,null,null,null,null,null,null,null,null,null,null,null,null,null,null,null,null,null,null,null,null,null,null,null,null,null,null,null,null,null,null,null,null,null,null,null,null,null,null,null,null,null,null,null,null,null,null,null,null,null,null,null,null,null,null,null,null,null,null,null,null,null,null,null,null,null,null,null,null,null,null,null,null,null,null,null,null,null,null,null,null,null,"."]
[null,null,null,null,null,null,null,null,null,null,null,null,null,null,null,null,null,null,null,null,null,null,null,null,null,null,null,null,null,null,null,null,null,null,null,null,null,null,null,null,null,null,null,null,null,null,null,null,null,null,null,null,null,null,null,null,null,null,null,null,null,null,null,null,null,null,null,null,null,null,null,null,null,null,null,null,null,null,null,null,null,null,null,null,null,null,null,null,null,null,null,null,null,null,null,null,null,null,null,null,null,null,null,null,null,null,null,null,null,null,null,null,null,null,null,null,null,null,null,null,null,null,null,null,null,null,null,null,null,null,null,null,null,null,null,null,null,null,null,null,null,null,"."]
[null,null,null,null,null,null,null,null,null,null,null,null,null,null,null,null,null,null,null,null,null,null,null,null,null,null,null,null,null,null,null,null,null,null,null,null,null,null,null,null,null,null,null,null,null,null,null,null,null,null,null,null,null,null,null,null,null,null,null,null,null,null,null,null,null,null,null,null,null,null,null,null,null,null,null,null,null,null,null,null,null,null,null,null,null,null,null,null,null,null,null,null,null,null,null,null,null,null,null,null,null,null,null,null,null,null,null,null,null,null,null,null,null,null,null,null,null,null,null,null,null,null,null,null,null,null,null,null,null,null,null,null,null,null,null,null,null,null,null,null,null,null,"."]
[null,null,null,null,null,null,null,null,null,null,null,null,null,null,null,null,null,null,null,null,null,null,null,null,null,null,null,null,null,null,null,null,null,null,null,null,null,null,null,null,null,null,null,null,null,null,null,null,null,null,null,null,null,null,null,null,null,null,null,null,null,null,null,null,null,null,null,null,null,null,null,null,null,null,null,null,null,null,null,null,null,null,null,null,null,null,null,null,null,null,null,null,null,null,null,null,null,null,null,null,null,null,null,null,null,null,null,null,null,null,null,null,null,null,null,null,null,null,null,null,null,null,null,null,null,null,null,null,null,null,null,null,null,null,null,null,null,null,null,null,null,null,"."]
[null,null,null,null,null,null,null,null,null,null,null,null,null,null,null,null,null,null,null,null,null,null,null,null,null,null,null,null,null,null,null,null,null,null,null,null,null,null,null,null,null,null,null,null,null,null,null,null,null,null,null,null,null,null,null,null,null,null,null,null,null,null,null,null,null,null,null,null,null,null,null,null,null,null,null,null,null,null,null,null,null,null,null,null,null,null,null,null,null,null,null,null,null,null,null,null,null,null,null,null,null,null,null,null,null,null,null,null,null,null,null,null,null,null,null,null,null,null,null,null,null,null,null,null,null,null,null,null,null,null,null,null,null,null,null,null,null,null,null,null,null,null,"."]
[null,null,null,null,null,null,null,null,null,null,null,null,null,null,null,null,null,null,null,null,null,null,null,null,null,null,null,null,null,null,null,null,null,null,null,null,null,null,null,null,null,null,null,null,null,null,null,null,null,null,null,null,null,null,null,null,null,null,null,null,null,null,null,null,null,null,null,null,null,null,null,null,null,null,null,null,null,null,null,null,null,null,null,null,null,null,null,null,null,null,null,null,null,null,null,null,null,null,null,null,null,null,null,null,null,null,null,null,null,null,null,null,null,null,null,null,null,null,null,null,null,null,null,null,null,null,null,null,null,null,null,null,null,null,null,null,null,null,null,null,null,null,"."]
[null,null,null,null,null,null,null,null,null,null,null,null,null,null,null,null,null,null,null,null,null,null,null,null,null,null,null,null,null,null,null,null,null,null,null,null,null,null,null,null,null,null,null,null,null,null,null,null,null,null,null,null,null,null,null,null,null,null,null,null,null,null,null,null,null,null,null,null,null,null,null,null,null,null,null,null,null,null,null,null,null,null,null,null,null,null,null,null,null,null,null,null,null,null,null,null,null,null,null,null,null,null,null,null,null,null,null,null,null,null,null,null,null,null,null,null,null,null,null,null,null,null,null,null,null,null,null,null,null,null,null,null,null,null,null,null,null,null,null,null,null,null,"."]
[null,null,null,null,null,null,null,null,null,null,null,null,null,null,null,null,null,null,null,null,null,null,null,null,null,null,null,null,null,null,null,null,null,null,null,null,null,null,null,null,null,null,null,null,null,null,null,null,null,null,null,null,null,null,null,null,null,null,null,null,null,null,null,null,null,null,null,null,null,null,null,null,null,null,null,null,null,null,null,null,null,null,null,null,null,null,null,null,null,null,null,null,null,null,null,null,null,null,null,null,null,null,null,null,null,null,null,null,null,null,null,null,null,null,null,null,null,null,null,null,null,null,null,null,null,null,null,null,null,null,null,null,null,null,null,null,null,null,null,null,null,null,"."]
[null,null,null,null,null,null,null,null,null,null,null,null,null,null,null,null,null,null,null,null,null,null,null,null,null,null,null,null,null,null,null,null,null,null,null,null,null,null,null,null,null,null,null,null,null,null,null,null,null,null,null,null,null,null,null,null,null,null,null,null,null,null,null,null,null,null,null,null,null,null,null,null,null,null,null,null,null,null,null,null,null,null,null,null,null,null,null,null,null,null,null,null,null,null,null,null,null,null,null,null,null,null,null,null,null,null,null,null,null,null,null,null,null,null,null,null,null,null,null,null,null,null,null,null,null,null,null,null,null,null,null,null,null,null,null,null,null,null,null,null,null,null,"."]
[null,null,null,null,null,null,null,null,null,null,null,null,null,null,null,null,null,null,null,null,null,null,null,null,null,null,null,null,null,null,null,null,null,null,null,null,null,null,null,null,null,null,null,null,null,null,null,null,null,null,null,null,null,null,null,null,null,null,null,null,null,null,null,null,null,null,null,null,null,null,null,null,null,null,null,null,null,null,null,null,null,null,null,null,null,null,null,null,null,null,null,null,null,null,null,null,null,null,null,null,null,null,null,null,null,null,null,null,null,null,null,null,null,null,null,null,null,null,null,null,null,null,null,null,null,null,null,null,null,null,null,null,null,null,null,null,null,null,null,null,null,null,"."]
[null,null,null,null,null,null,null,null,null,null,null,null,null,null,null,null,null,null,null,null,null,null,null,null,null,null,null,null,null,null,null,null,null,null,null,null,null,null,null,null,null,null,null,null,null,null,null,null,null,null,null,null,null,null,null,null,null,null,null,null,null,null,null,null,null,null,null,null,null,null,null,null,null,null,null,null,null,null,null,null,null,null,null,null,null,null,null,null,null,null,null,null,null,null,null,null,null,null,null,null,null,null,null,null,null,null,null,null,null,null,null,null,null,null,null,null,null,null,null,null,null,null,null,null,null,null,null,null,null,null,null,null,null,null,null,null,null,null,null,null,null,null,"."]
[null,null,null,null,null,null,null,null,null,null,null,null,null,null,null,null,null,null,null,null,null,null,null,null,null,null,null,null,null,null,null,null,null,null,null,null,null,null,null,null,null,null,null,null,null,null,null,null,null,null,null,null,null,null,null,null,null,null,null,null,null,null,null,null,null,null,null,null,null,null,null,null,null,null,null,null,null,null,null,null,null,null,null,null,null,null,null,null,null,null,null,null,null,null,null,null,null,null,null,null,null,null,null,null,null,null,null,null,null,null,null,null,null,null,null,null,null,null,null,null,null,null,null,null,null,null,null,null,null,null,null,null,null,null,null,null,null,null,null,null,null,null,"."]
[null,null,null,null,null,null,null,null,null,null,null,null,null,null,null,null,null,null,null,null,null,null,null,null,null,null,null,null,null,null,null,null,null,null,null,null,null,null,null,null,null,null,null,null,null,null,null,null,null,null,null,null,null,null,null,null,null,null,null,null,null,null,null,null,null,null,null,null,null,null,null,null,null,null,null,null,null,null,null,null,null,null,null,null,null,null,null,null,null,null,null,null,null,null,null,null,null,null,null,null,null,null,null,null,null,null,null,null,null,null,null,null,null,null,null,null,null,null,null,null,null,null,null,null,null,null,null,null,null,null,null,null,null,null,null,null,null,null,null,null,null,null,"."]
[null,null,null,null,null,null,null,null,null,null,null,null,null,null,null,null,null,null,null,null,null,null,null,null,null,null,null,null,null,null,null,null,null,null,null,null,null,null,null,null,null,null,null,null,null,null,null,null,null,null,null,null,null,null,null,null,null,null,null,null,null,null,null,null,null,null,null,null,null,null,null,null,null,null,null,null,null,null,null,null,null,null,null,null,null,null,null,null,null,null,null,null,null,null,null,null,null,null,null,null,null,null,null,null,null,null,null,null,null,null,null,null,null,null,null,null,null,null,null,null,null,null,null,null,null,null,null,null,null,null,null,null,null,null,null,null,null,null,null,null,null,null,"."]
[null,null,null,null,null,null,null,null,null,null,null,null,null,null,null,null,null,null,null,null,null,null,null,null,null,null,null,null,null,null,null,null,null,null,null,null,null,null,null,null,null,null,null,null,null,null,null,null,null,null,null,null,null,null,null,null,null,null,null,null,null,null,null,null,null,null,null,null,null,null,null,null,null,null,null,null,null,null,null,null,null,null,null,null,null,null,null,null,null,null,null,null,null,null,null,null,null,null,null,null,null,null,null,null,null,null,null,null,null,null,null,null,null,null,null,null,null,null,null,null,null,null,null,null,null,null,null,null,null,null,null,null,null,null,null,null,null,null,null,null,null,null,"."]
[null,null,null,null,null,null,null,null,null,null,null,null,null,null,null,null,null,null,null,null,null,null,null,null,null,null,null,null,null,null,null,null,null,null,null,null,null,null,null,null,null,null,null,null,null,null,null,null,null,null,null,null,null,null,null,null,null,null,null,null,null,null,null,null,null,null,null,null,null,null,null,null,null,null,null,null,null,null,null,null,null,null,null,null,null,null,null,null,null,null,null,null,null,null,null,null,null,null,null,null,null,null,null,null,null,null,null,null,null,null,null,null,null,null,null,null,null,null,null,null,null,null,null,null,null,null,null,null,null,null,null,null,null,null,null,null,null,null,null,null,null,null,"."]
[null,null,null,null,null,null,null,null,null,null,null,null,null,null,null,null,null,null,null,null,null,null,null,null,null,null,null,null,null,null,null,null,null,null,null,null,null,null,null,null,null,null,null,null,null,null,null,null,null,null,null,null,null,null,null,null,null,null,null,null,null,null,null,null,null,null,null,null,null,null,null,null,null,null,null,null,null,null,null,null,null,null,null,null,null,null,null,null,null,null,null,null,null,null,null,null,null,null,null,null,null,null,null,null,null,null,null,null,null,null,null,null,null,null,null,null,null,null,null,null,null,null,null,null,null,null,null,null,null,null,null,null,null,null,null,null,null,null,null,null,null,null,"."]
[null,null,null,null,null,null,null,null,null,null,null,null,null,null,null,null,null,null,null,null,null,null,null,null,null,null,null,null,null,null,null,null,null,null,null,null,null,null,null,null,null,null,null,null,null,null,null,null,null,null,null,null,null,null,null,null,null,null,null,null,null,null,null,null,null,null,null,null,null,null,null,null,null,null,null,null,null,null,null,null,null,null,null,null,null,null,null,null,null,null,null,null,null,null,null,null,null,null,null,null,null,null,null,null,null,null,null,null,null,null,null,null,null,null,null,null,null,null,null,null,null,null,null,null,null,null,null,null,null,null,null,null,null,null,null,null,null,null,null,null,null,null,"."]
[null,null,null,null,null,null,null,null,null,null,null,null,null,null,null,null,null,null,null,null,null,null,null,null,null,null,null,null,null,null,null,null,null,null,null,null,null,null,null,null,null,null,null,null,null,null,null,null,null,null,null,null,null,null,null,null,null,null,null,null,null,null,null,null,null,null,null,null,null,null,null,null,null,null,null,null,null,null,null,null,null,null,null,null,null,null,null,null,null,null,null,null,null,null,null,null,null,null,null,null,null,null,null,null,null,null,null,null,null,null,null,null,null,null,null,null,null,null,null,null,null,null,null,null,null,null,null,null,null,null,null,null,null,null,null,null,null,null,null,null,null,null,"."]
[null,null,null,null,null,null,null,null,null,null,null,null,null,null,null,null,null,null,null,null,null,null,null,null,null,null,null,null,null,null,null,null,null,null,null,null,null,null,null,null,null,null,null,null,null,null,null,null,null,null,null,null,null,null,null,null,null,null,null,null,null,null,null,null,null,null,null,null,null,null,null,null,null,null,null,null,null,null,null,null,null,null,null,null,null,null,null,null,null,null,null,null,null,null,null,null,null,null,null,null,null,null,null,null,null,null,null,null,null,null,null,null,null,null,null,null,null,null,null,null,null,null,null,null,null,null,null,null,null,null,null,null,null,null,null,null,null,null,null,null,null,null,"."]
[null,null,null,null,null,null,null,null,null,null,null,null,null,null,null,null,null,null,null,null,null,null,null,null,null,null,null,null,null,null,null,null,null,null,null,null,null,null,null,null,null,null,null,null,null,null,null,null,null,null,null,null,null,null,null,null,null,null,null,null,null,null,null,null,null,null,null,null,null,null,null,null,null,null,null,null,null,null,null,null,null,null,null,null,null,null,null,null,null,null,null,null,null,null,null,null,null,null,null,null,null,null,null,null,null,null,null,null,null,null,null,null,null,null,null,null,null,null,null,null,null,null,null,null,null,null,null,null,null,null,null,null,null,null,null,null,null,null,null,null,null,null,"."]
[null,null,null,null,null,null,null,null,null,null,null,null,null,null,null,null,null,null,null,null,null,null,null,null,null,null,null,null,null,null,null,null,null,null,null,null,null,null,null,null,null,null,null,null,null,null,null,null,null,null,null,null,null,null,null,null,null,null,null,null,null,null,null,null,null,null,null,null,null,null,null,null,null,null,null,null,null,null,null,null,null,null,null,null,null,null,null,null,null,null,null,null,null,null,null,null,null,null,null,null,null,null,null,null,null,null,null,null,null,null,null,null,null,null,null,null,null,null,null,null,null,null,null,null,null,null,null,null,null,null,null,null,null,null,null,null,null,null,null,null,null,null,"."]
[null,null,null,null,null,null,null,null,null,null,null,null,null,null,null,null,null,null,null,null,null,null,null,null,null,null,null,null,null,null,null,null,null,null,null,null,null,null,null,null,null,null,null,null,null,null,null,null,null,null,null,null,null,null,null,null,null,null,null,null,null,null,null,null,null,null,null,null,null,null,null,null,null,null,null,null,null,null,null,null,null,null,null,null,null,null,null,null,null,null,null,null,null,null,null,null,null,null,null,null,null,null,null,null,null,null,null,null,null,null,null,null,null,null,null,null,null,null,null,null,null,null,null,null,null,null,null,null,null,null,null,null,null,null,null,null,null,null,null,null,null,null,"."]
[null,null,null,null,null,null,null,null,null,null,null,null,null,null,null,null,null,null,null,null,null,null,null,null,null,null,null,null,null,null,null,null,null,null,null,null,null,null,null,null,null,null,null,null,null,null,null,null,null,null,null,null,null,null,null,null,null,null,null,null,null,null,null,null,null,null,null,null,null,null,null,null,null,null,null,null,null,null,null,null,null,null,null,null,null,null,null,null,null,null,null,null,null,null,null,null,null,null,null,null,null,null,null,null,null,null,null,null,null,null,null,null,null,null,null,null,null,null,null,null,null,null,null,null,null,null,null,null,null,null,null,null,null,null,null,null,null,null,null,null,null,null,"."]
[null,null,null,null,null,null,null,null,null,null,null,null,null,null,null,null,null,null,null,null,null,null,null,null,null,null,null,null,null,null,null,null,null,null,null,null,null,null,null,null,null,null,null,null,null,null,null,null,null,null,null,null,null,null,null,null,null,null,null,null,null,null,null,null,null,null,null,null,null,null,null,null,null,null,null,null,null,null,null,null,null,null,null,null,null,null,null,null,null,null,null,null,null,null,null,null,null,null,null,null,null,null,null,null,null,null,null,null,null,null,null,null,null,null,null,null,null,null,null,null,null,null,null,null,null,null,null,null,null,null,null,null,null,null,null,null,null,null,null,null,null,null,"."]
[null,null,null,null,null,null,null,null,null,null,null,null,null,null,null,null,null,null,null,null,null,null,null,null,null,null,null,null,null,null,null,null,null,null,null,null,null,null,null,null,null,null,null,null,null,null,null,null,null,null,null,null,null,null,null,null,null,null,null,null,null,null,null,null,null,null,null,null,null,null,null,null,null,null,null,null,null,null,null,null,null,null,null,null,null,null,null,null,null,null,null,null,null,null,null,null,null,null,null,null,null,null,null,null,null,null,null,null,null,null,null,null,null,null,null,null,null,null,null,null,null,null,null,null,null,null,null,null,null,null,null,null,null,null,null,null,null,null,null,null,null,null,"."]
[null,null,null,null,null,null,null,null,null,null,null,null,null,null,null,null,null,null,null,null,null,null,null,null,null,null,null,null,null,null,null,null,null,null,null,null,null,null,null,null,null,null,null,null,null,null,null,null,null,null,null,null,null,null,null,null,null,null,null,null,null,null,null,null,null,null,null,null,null,null,null,null,null,null,null,null,null,null,null,null,null,null,null,null,null,null,null,null,null,null,null,null,null,null,null,null,null,null,null,null,null,null,null,null,null,null,null,null,null,null,null,null,null,null,null,null,null,null,null,null,null,null,null,null,null,null,null,null,null,null,null,null,null,null,null,null,null,null,null,null,null,null,"."]
[null,null,null,null,null,null,null,null,null,null,null,null,null,null,null,null,null,null,null,null,null,null,null,null,null,null,null,null,null,null,null,null,null,null,null,null,null,null,null,null,null,null,null,null,null,null,null,null,null,null,null,null,null,null,null,null,null,null,null,null,null,null,null,null,null,null,null,null,null,null,null,null,null,null,null,null,null,null,null,null,null,null,null,null,null,null,null,null,null,null,null,null,null,null,null,null,null,null,null,null,null,null,null,null,null,null,null,null,null,null,null,null,null,null,null,null,null,null,null,null,null,null,null,null,null,null,null,null,null,null,null,null,null,null,null,null,null,null,null,null,null,null,"."]
[null,null,null,null,null,null,null,null,null,null,null,null,null,null,null,null,null,null,null,null,null,null,null,null,null,null,null,null,null,null,null,null,null,null,null,null,null,null,null,null,null,null,null,null,null,null,null,null,null,null,null,null,null,null,null,null,null,null,null,null,null,null,null,null,null,null,null,null,null,null,null,null,null,null,null,null,null,null,null,null,null,null,null,null,null,null,null,null,null,null,null,null,null,null,null,null,null,null,null,null,null,null,null,null,null,null,null,null,null,null,null,null,null,null,null,null,null,null,null,null,null,null,null,null,null,null,null,null,null,null,null,null,null,null,null,null,null,null,null,null,null,null,"."]
[null,null,null,null,null,null,null,null,null,null,null,null,null,null,null,null,null,null,null,null,null,null,null,null,null,null,null,null,null,null,null,null,null,null,null,null,null,null,null,null,null,null,null,null,null,null,null,null,null,null,null,null,null,null,null,null,null,null,null,null,null,null,null,null,null,null,null,null,null,null,null,null,null,null,null,null,null,null,null,null,null,null,null,null,null,null,null,null,null,null,null,null,null,null,null,null,null,null,null,null,null,null,null,null,null,null,null,null,null,null,null,null,null,null,null,null,null,null,null,null,null,null,null,null,null,null,null,null,null,null,null,null,null,null,null,null,null,null,null,null,null,null,"."]
[null,null,null,null,null,null,null,null,null,null,null,null,null,null,null,null,null,null,null,null,null,null,null,null,null,null,null,null,null,null,null,null,null,null,null,null,null,null,null,null,null,null,null,null,null,null,null,null,null,null,null,null,null,null,null,null,null,null,null,null,null,null,null,null,null,null,null,null,null,null,null,null,null,null,null,null,null,null,null,null,null,null,null,null,null,null,null,null,null,null,null,null,null,null,null,null,null,null,null,null,null,null,null,null,null,null,null,null,null,null,null,null,null,null,null,null,null,null,null,null,null,null,null,null,null,null,null,null,null,null,null,null,null,null,null,null,null,null,null,null,null,null,"."]
[null,null,null,null,null,null,null,null,null,null,null,null,null,null,null,null,null,null,null,null,null,null,null,null,null,null,null,null,null,null,null,null,null,null,null,null,null,null,null,null,null,null,null,null,null,null,null,null,null,null,null,null,null,null,null,null,null,null,null,null,null,null,null,null,null,null,null,null,null,null,null,null,null,null,null,null,null,null,null,null,null,null,null,null,null,null,null,null,null,null,null,null,null,null,null,null,null,null,null,null,null,null,null,null,null,null,null,null,null,null,null,null,null,null,null,null,null,null,null,null,null,null,null,null,null,null,null,null,null,null,null,null,null,null,null,null,null,null,null,null,null,null,"."]
[null,null,null,null,null,null,null,null,null,null,null,null,null,null,null,null,null,null,null,null,null,null,null,null,null,null,null,null,null,null,null,null,null,null,null,null,null,null,null,null,null,null,null,null,null,null,null,null,null,null,null,null,null,null,null,null,null,null,null,null,null,null,null,null,null,null,null,null,null,null,null,null,null,null,null,null,null,null,null,null,null,null,null,null,null,null,null,null,null,null,null,null,null,null,null,null,null,null,null,null,null,null,null,null,null,null,null,null,null,null,null,null,null,null,null,null,null,null,null,null,null,null,null,null,null,null,null,null,null,null,null,null,null,null,null,null,null,null,null,null,null,null,"."]
[null,null,null,null,null,null,null,null,null,null,null,null,null,null,null,null,null,null,null,null,null,null,null,null,null,null,null,null,null,null,null,null,null,null,null,null,null,null,null,null,null,null,null,null,null,null,null,null,null,null,null,null,null,null,null,null,null,null,null,null,null,null,null,null,null,null,null,null,null,null,null,null,null,null,null,null,null,null,null,null,null,null,null,null,null,null,null,null,null,null,null,null,null,null,null,null,null,null,null,null,null,null,null,null,null,null,null,null,null,null,null,null,null,null,null,null,null,null,null,null,null,null,null,null,null,null,null,null,null,null,null,null,null,null,null,null,null,null,null,null,null,null,"."]
[null,null,null,null,null,null,null,null,null,null,null,null,null,null,null,null,null,null,null,null,null,null,null,null,null,null,null,null,null,null,null,null,null,null,null,null,null,null,null,null,null,null,null,null,null,null,null,null,null,null,null,null,null,null,null,null,null,null,null,null,null,null,null,null,null,null,null,null,null,null,null,null,null,null,null,null,null,null,null,null,null,null,null,null,null,null,null,null,null,null,null,null,null,null,null,null,null,null,null,null,null,null,null,null,null,null,null,null,null,null,null,null,null,null,null,null,null,null,null,null,null,null,null,null,null,null,null,null,null,null,null,null,null,null,null,null,null,null,null,null,null,null,"."]
[null,null,null,null,null,null,null,null,null,null,null,null,null,null,null,null,null,null,null,null,null,null,null,null,null,null,null,null,null,null,null,null,null,null,null,null,null,null,null,null,null,null,null,null,null,null,null,null,null,null,null,null,null,null,null,null,null,null,null,null,null,null,null,null,null,null,null,null,null,null,null,null,null,null,null,null,null,null,null,null,null,null,null,null,null,null,null,null,null,null,null,null,null,null,null,null,null,null,null,null,null,null,null,null,null,null,null,null,null,null,null,null,null,null,null,null,null,null,null,null,null,null,null,null,null,null,null,null,null,null,null,null,null,null,null,null,null,null,null,null,null,null,"."]
[null,null,null,null,null,null,null,null,null,null,null,null,null,null,null,null,null,null,null,null,null,null,null,null,null,null,null,null,null,null,null,null,null,null,null,null,null,null,null,null,null,null,null,null,null,null,null,null,null,null,null,null,null,null,null,null,null,null,null,null,null,null,null,null,null,null,null,null,null,null,null,null,null,null,null,null,null,null,null,null,null,null,null,null,null,null,null,null,null,null,null,null,null,null,null,null,null,null,null,null,null,null,null,null,null,null,null,null,null,null,null,null,null,null,null,null,null,null,null,null,null,null,null,null,null,null,null,null,null,null,null,null,null,null,null,null,null,null,null,null,null,null,"."]
[null,null,null,null,null,null,null,null,null,null,null,null,null,null,null,null,null,null,null,null,null,null,null,null,null,null,null,null,null,null,null,null,null,null,null,null,null,null,null,null,null,null,null,null,null,null,null,null,null,null,null,null,null,null,null,null,null,null,null,null,null,null,null,null,null,null,null,null,null,null,null,null,null,null,null,null,null,null,null,null,null,null,null,null,null,null,null,null,null,null,null,null,null,null,null,null,null,null,null,null,null,null,null,null,null,null,null,null,null,null,null,null,null,null,null,null,null,null,null,null,null,null,null,null,null,null,null,null,null,null,null,null,null,null,null,null,null,null,null,null,null,null,"."]
[null,null,null,null,null,null,null,null,null,null,null,null,null,null,null,null,null,null,null,null,null,null,null,null,null,null,null,null,null,null,null,null,null,null,null,null,null,null,null,null,null,null,null,null,null,null,null,null,null,null,null,null,null,null,null,null,null,null,null,null,null,null,null,null,null,null,null,null,null,null,null,null,null,null,null,null,null,null,null,null,null,null,null,null,null,null,null,null,null,null,null,null,null,null,null,null,null,null,null,null,null,null,null,null,null,null,null,null,null,null,null,null,null,null,null,null,null,null,null,null,null,null,null,null,null,null,null,null,null,null,null,null,null,null,null,null,null,null,null,null,null,null,"."]
[null,null,null,null,null,null,null,null,null,null,null,null,null,null,null,null,null,null,null,null,null,null,null,null,null,null,null,null,null,null,null,null,null,null,null,null,null,null,null,null,null,null,null,null,null,null,null,null,null,null,null,null,null,null,null,null,null,null,null,null,null,null,null,null,null,null,null,null,null,null,null,null,null,null,null,null,null,null,null,null,null,null,null,null,null,null,null,null,null,null,null,null,null,null,null,null,null,null,null,null,null,null,null,null,null,null,null,null,null,null,null,null,null,null,null,null,null,null,null,null,null,null,null,null,null,null,null,null,null,null,null,null,null,null,null,null,null,null,null,null,null,null,"."]
[null,null,null,null,null,null,null,null,null,null,null,null,null,null,null,null,null,null,null,null,null,null,null,null,null,null,null,null,null,null,null,null,null,null,null,null,null,null,null,null,null,null,null,null,null,null,null,null,null,null,null,null,null,null,null,null,null,null,null,null,null,null,null,null,null,null,null,null,null,null,null,null,null,null,null,null,null,null,null,null,null,null,null,null,null,null,null,null,null,null,null,null,null,null,null,null,null,null,null,null,null,null,null,null,null,null,null,null,null,null,null,null,null,null,null,null,null,null,null,null,null,null,null,null,null,null,null,null,null,null,null,null,null,null,null,null,null,null,null,null,null,null,"."]
[null,null,null,null,null,null,null,null,null,null,null,null,null,null,null,null,null,null,null,null,null,null,null,null,null,null,null,null,null,null,null,null,null,null,null,null,null,null,null,null,null,null,null,null,null,null,null,null,null,null,null,null,null,null,null,null,null,null,null,null,null,null,null,null,null,null,null,null,null,null,null,null,null,null,null,null,null,null,null,null,null,null,null,null,null,null,null,null,null,null,null,null,null,null,null,null,null,null,null,null,null,null,null,null,null,null,null,null,null,null,null,null,null,null,null,null,null,null,null,null,null,null,null,null,null,null,null,null,null,null,null,null,null,null,null,null,null,null,null,null,null,null,"."]
[null,null,null,null,null,null,null,null,null,null,null,null,null,null,null,null,null,null,null,null,null,null,null,null,null,null,null,null,null,null,null,null,null,null,null,null,null,null,null,null,null,null,null,null,null,null,null,null,null,null,null,null,null,null,null,null,null,null,null,null,null,null,null,null,null,null,null,null,null,null,null,null,null,null,null,null,null,null,null,null,null,null,null,null,null,null,null,null,null,null,null,null,null,null,null,null,null,null,null,null,null,null,null,null,null,null,null,null,null,null,null,null,null,null,null,null,null,null,null,null,null,null,null,null,null,null,null,null,null,null,null,null,null,null,null,null,null,null,null,null,null,null,"."]
[null,null,null,null,null,null,null,null,null,null,null,null,null,null,null,null,null,null,null,null,null,null,null,null,null,null,null,null,null,null,null,null,null,null,null,null,null,null,null,null,null,null,null,null,null,null,null,null,null,null,null,null,null,null,null,null,null,null,null,null,null,null,null,null,null,null,null,null,null,null,null,null,null,null,null,null,null,null,null,null,null,null,null,null,null,null,null,null,null,null,null,null,null,null,null,null,null,null,null,null,null,null,null,null,null,null,null,null,null,null,null,null,null,null,null,null,null,null,null,null,null,null,null,null,null,null,null,null,null,null,null,null,null,null,null,null,null,null,null,null,null,null,"."]
[null,null,null,null,null,null,null,null,null,null,null,null,null,null,null,null,null,null,null,null,null,null,null,null,null,null,null,null,null,null,null,null,null,null,null,null,null,null,null,null,null,null,null,null,null,null,null,null,null,null,null,null,null,null,null,null,null,null,null,null,null,null,null,null,null,null,null,null,null,null,null,null,null,null,null,null,null,null,null,null,null,null,null,null,null,null,null,null,null,null,null,null,null,null,null,null,null,null,null,null,null,null,null,null,null,null,null,null,null,null,null,null,null,null,null,null,null,null,null,null,null,null,null,null,null,null,null,null,null,null,null,null,null,null,null,null,null,null,null,null,null,null,"."]
[null,null,null,null,null,null,null,null,null,null,null,null,null,null,null,null,null,null,null,null,null,null,null,null,null,null,null,null,null,null,null,null,null,null,null,null,null,null,null,null,null,null,null,null,null,null,null,null,null,null,null,null,null,null,null,null,null,null,null,null,null,null,null,null,null,null,null,null,null,null,null,null,null,null,null,null,null,null,null,null,null,null,null,null,null,null,null,null,null,null,null,null,null,null,null,null,null,null,null,null,null,null,null,null,null,null,null,null,null,null,null,null,null,null,null,null,null,null,null,null,null,null,null,null,null,null,null,null,null,null,null,null,null,null,null,null,null,null,null,null,null,null,"."]
[null,null,null,null,null,null,null,null,null,null,null,null,null,null,null,null,null,null,null,null,null,null,null,null,null,null,null,null,null,null,null,null,null,null,null,null,null,null,null,null,null,null,null,null,null,null,null,null,null,null,null,null,null,null,null,null,null,null,null,null,null,null,null,null,null,null,null,null,null,null,null,null,null,null,null,null,null,null,null,null,null,null,null,null,null,null,null,null,null,null,null,null,null,null,null,null,null,null,null,null,null,null,null,null,null,null,null,null,null,null,null,null,null,null,null,null,null,null,null,null,null,null,null,null,null,null,null,null,null,null,null,null,null,null,null,null,null,null,null,null,null,null,"."]
[null,null,null,null,null,null,null,null,null,null,null,null,null,null,null,null,null,null,null,null,null,null,null,null,null,null,null,null,null,null,null,null,null,null,null,null,null,null,null,null,null,null,null,null,null,null,null,null,null,null,null,null,null,null,null,null,null,null,null,null,null,null,null,null,null,null,null,null,null,null,null,null,null,null,null,null,null,null,null,null,null,null,null,null,null,null,null,null,null,null,null,null,null,null,null,null,null,null,null,null,null,null,null,null,null,null,null,null,null,null,null,null,null,null,null,null,null,null,null,null,null,null,null,null,null,null,null,null,null,null,null,null,null,null,null,null,null,null,null,null,null,null,"."]
[null,null,null,null,null,null,null,null,null,null,null,null,null,null,null,null,null,null,null,null,null,null,null,null,null,null,null,null,null,null,null,null,null,null,null,null,null,null,null,null,null,null,null,null,null,null,null,null,null,null,null,null,null,null,null,null,null,null,null,null,null,null,null,null,null,null,null,null,null,null,null,null,null,null,null,null,null,null,null,null,null,null,null,null,null,null,null,null,null,null,null,null,null,null,null,null,null,null,null,null,null,null,null,null,null,null,null,null,null,null,null,null,null,null,null,null,null,null,null,null,null,null,null,null,null,null,null,null,null,null,null,null,null,null,null,null,null,null,null,null,null,null,"."]
[null,null,null,null,null,null,null,null,null,null,null,null,null,null,null,null,null,null,null,null,null,null,null,null,null,null,null,null,null,null,null,null,null,null,null,null,null,null,null,null,null,null,null,null,null,null,null,null,null,null,null,null,null,null,null,null,null,null,null,null,null,null,null,null,null,null,null,null,null,null,null,null,null,null,null,null,null,null,null,null,null,null,null,null,null,null,null,null,null,null,null,null,null,null,null,null,null,null,null,null,null,null,null,null,null,null,null,null,null,null,null,null,null,null,null,null,null,null,null,null,null,null,null,null,null,null,null,null,null,null,null,null,null,null,null,null,null,null,null,null,null,null,"."]
[null,null,null,null,null,null,null,null,null,null,null,null,null,null,null,null,null,null,null,null,null,null,null,null,null,null,null,null,null,null,null,null,null,null,null,null,null,null,null,null,null,null,null,null,null,null,null,null,null,null,null,null,null,null,null,null,null,null,null,null,null,null,null,null,null,null,null,null,null,null,null,null,null,null,null,null,null,null,null,null,null,null,null,null,null,null,null,null,null,null,null,null,null,null,null,null,null,null,null,null,null,null,null,null,null,null,null,null,null,null,null,null,null,null,null,null,null,null,null,null,null,null,null,null,null,null,null,null,null,null,null,null,null,null,null,null,null,null,null,null,null,null,"."]
[null,null,null,null,null,null,null,null,null,null,null,null,null,null,null,null,null,null,null,null,null,null,null,null,null,null,null,null,null,null,null,null,null,null,null,null,null,null,null,null,null,null,null,null,null,null,null,null,null,null,null,null,null,null,null,null,null,null,null,null,null,null,null,null,null,null,null,null,null,null,null,null,null,null,null,null,null,null,null,null,null,null,null,null,null,null,null,null,null,null,null,null,null,null,null,null,null,null,null,null,null,null,null,null,null,null,null,null,null,null,null,null,null,null,null,null,null,null,null,null,null,null,null,null,null,null,null,null,null,null,null,null,null,null,null,null,null,null,null,null,null,null,"."]
[null,null,null,null,null,null,null,null,null,null,null,null,null,null,null,null,null,null,null,null,null,null,null,null,null,null,null,null,null,null,null,null,null,null,null,null,null,null,null,null,null,null,null,null,null,null,null,null,null,null,null,null,null,null,null,null,null,null,null,null,null,null,null,null,null,null,null,null,null,null,null,null,null,null,null,null,null,null,null,null,null,null,null,null,null,null,null,null,null,null,null,null,null,null,null,null,null,null,null,null,null,null,null,null,null,null,null,null,null,null,null,null,null,null,null,null,null,null,null,null,null,null,null,null,null,null,null,null,null,null,null,null,null,null,null,null,null,null,null,null,null,null,"."]
[null,null,null,null,null,null,null,null,null,null,null,null,null,null,null,null,null,null,null,null,null,null,null,null,null,null,null,null,null,null,null,null,null,null,null,null,null,null,null,null,null,null,null,null,null,null,null,null,null,null,null,null,null,null,null,null,null,null,null,null,null,null,null,null,null,null,null,null,null,null,null,null,null,null,null,null,null,null,null,null,null,null,null,null,null,null,null,null,null,null,null,null,null,null,null,null,null,null,null,null,null,null,null,null,null,null,null,null,null,null,null,null,null,null,null,null,null,null,null,null,null,null,null,null,null,null,null,null,null,null,null,null,null,null,null,null,null,null,null,null,null,null,"."]
[null,null,null,null,null,null,null,null,null,null,null,null,null,null,null,null,null,null,null,null,null,null,null,null,null,null,null,null,null,null,null,null,null,null,null,null,null,null,null,null,null,null,null,null,null,null,null,null,null,null,null,null,null,null,null,null,null,null,null,null,null,null,null,null,null,null,null,null,null,null,null,null,null,null,null,null,null,null,null,null,null,null,null,null,null,null,null,null,null,null,null,null,null,null,null,null,null,null,null,null,null,null,null,null,null,null,null,null,null,null,null,null,null,null,null,null,null,null,null,null,null,null,null,null,null,null,null,null,null,null,null,null,null,null,null,null,null,null,null,null,null,null,"."]
[null,null,null,null,null,null,null,null,null,null,null,null,null,null,null,null,null,null,null,null,null,null,null,null,null,null,null,null,null,null,null,null,null,null,null,null,null,null,null,null,null,null,null,null,null,null,null,null,null,null,null,null,null,null,null,null,null,null,null,null,null,null,null,null,null,null,null,null,null,null,null,null,null,null,null,null,null,null,null,null,null,null,null,null,null,null,null,null,null,null,null,null,null,null,null,null,null,null,null,null,null,null,null,null,null,null,null,null,null,null,null,null,null,null,null,null,null,null,null,null,null,null,null,null,null,null,null,null,null,null,null,null,null,null,null,null,null,null,null,null,null,null,"."]
[null,null,null,null,null,null,null,null,null,null,null,null,null,null,null,null,null,null,null,null,null,null,null,null,null,null,null,null,null,null,null,null,null,null,null,null,null,null,null,null,null,null,null,null,null,null,null,null,null,null,null,null,null,null,null,null,null,null,null,null,null,null,null,null,null,null,null,null,null,null,null,null,null,null,null,null,null,null,null,null,null,null,null,null,null,null,null,null,null,null,null,null,null,null,null,null,null,null,null,null,null,null,null,null,null,null,null,null,null,null,null,null,null,null,null,null,null,null,null,null,null,null,null,null,null,null,null,null,null,null,null,null,null,null,null,null,null,null,null,null,null,null,"."]
[null,null,null,null,null,null,null,null,null,null,null,null,null,null,null,null,null,null,null,null,null,null,null,null,null,null,null,null,null,null,null,null,null,null,null,null,null,null,null,null,null,null,null,null,null,null,null,null,null,null,null,null,null,null,null,null,null,null,null,null,null,null,null,null,null,null,null,null,null,null,null,null,null,null,null,null,null,null,null,null,null,null,null,null,null,null,null,null,null,null,null,null,null,null,null,null,null,null,null,null,null,null,null,null,null,null,null,null,null,null,null,null,null,null,null,null,null,null,null,null,null,null,null,null,null,null,null,null,null,null,null,null,null,null,null,null,null,null,null,null,null,null,"."]
[null,null,null,null,null,null,null,null,null,null,null,null,null,null,null,null,null,null,null,null,null,null,null,null,null,null,null,null,null,null,null,null,null,null,null,null,null,null,null,null,null,null,null,null,null,null,null,null,null,null,null,null,null,null,null,null,null,null,null,null,null,null,null,null,null,null,null,null,null,null,null,null,null,null,null,null,null,null,null,null,null,null,null,null,null,null,null,null,null,null,null,null,null,null,null,null,null,null,null,null,null,null,null,null,null,null,null,null,null,null,null,null,null,null,null,null,null,null,null,null,null,null,null,null,null,null,null,null,null,null,null,null,null,null,null,null,null,null,null,null,null,null,"."]
[null,null,null,null,null,null,null,null,null,null,null,null,null,null,null,null,null,null,null,null,null,null,null,null,null,null,null,null,null,null,null,null,null,null,null,null,null,null,null,null,null,null,null,null,null,null,null,null,null,null,null,null,null,null,null,null,null,null,null,null,null,null,null,null,null,null,null,null,null,null,null,null,null,null,null,null,null,null,null,null,null,null,null,null,null,null,null,null,null,null,null,null,null,null,null,null,null,null,null,null,null,null,null,null,null,null,null,null,null,null,null,null,null,null,null,null,null,null,null,null,null,null,null,null,null,null,null,null,null,null,null,null,null,null,null,null,null,null,null,null,null,null,"."]
[null,null,null,null,null,null,null,null,null,null,null,null,null,null,null,null,null,null,null,null,null,null,null,null,null,null,null,null,null,null,null,null,null,null,null,null,null,null,null,null,null,null,null,null,null,null,null,null,null,null,null,null,null,null,null,null,null,null,null,null,null,null,null,null,null,null,null,null,null,null,null,null,null,null,null,null,null,null,null,null,null,null,null,null,null,null,null,null,null,null,null,null,null,null,null,null,null,null,null,null,null,null,null,null,null,null,null,null,null,null,null,null,null,null,null,null,null,null,null,null,null,null,null,null,null,null,null,null,null,null,null,null,null,null,null,null,null,null,null,null,null,null,"."]
[null,null,null,null,null,null,null,null,null,null,null,null,null,null,null,null,null,null,null,null,null,null,null,null,null,null,null,null,null,null,null,null,null,null,null,null,null,null,null,null,null,null,null,null,null,null,null,null,null,null,null,null,null,null,null,null,null,null,null,null,null,null,null,null,null,null,null,null,null,null,null,null,null,null,null,null,null,null,null,null,null,null,null,null,null,null,null,null,null,null,null,null,null,null,null,null,null,null,null,null,null,null,null,null,null,null,null,null,null,null,null,null,null,null,null,null,null,null,null,null,null,null,null,null,null,null,null,null,null,null,null,null,null,null,null,null,null,null,null,null,null,null,"."]
[null,null,null,null,null,null,null,null,null,null,null,null,null,null,null,null,null,null,null,null,null,null,null,null,null,null,null,null,null,null,null,null,null,null,null,null,null,null,null,null,null,null,null,null,null,null,null,null,null,null,null,null,null,null,null,null,null,null,null,null,null,null,null,null,null,null,null,null,null,null,null,null,null,null,null,null,null,null,null,null,null,null,null,null,null,null,null,null,null,null,null,null,null,null,null,null,null,null,null,null,null,null,null,null,null,null,null,null,null,null,null,null,null,null,null,null,null,null,null,null,null,null,null,null,null,null,null,null,null,null,null,null,null,null,null,null,null,null,null,null,null,null,"."]
[null,null,null,null,null,null,null,null,null,null,null,null,null,null,null,null,null,null,null,null,null,null,null,null,null,null,null,null,null,null,null,null,null,null,null,null,null,null,null,null,null,null,null,null,null,null,null,null,null,null,null,null,null,null,null,null,null,null,null,null,null,null,null,null,null,null,null,null,null,null,null,null,null,null,null,null,null,null,null,null,null,null,null,null,null,null,null,null,null,null,null,null,null,null,null,null,null,null,null,null,null,null,null,null,null,null,null,null,null,null,null,null,null,null,null,null,null,null,null,null,null,null,null,null,null,null,null,null,null,null,null,null,null,null,null,null,null,null,null,null,null,null,"."]
[null,null,null,null,null,null,null,null,null,null,null,null,null,null,null,null,null,null,null,null,null,null,null,null,null,null,null,null,null,null,null,null,null,null,null,null,null,null,null,null,null,null,null,null,null,null,null,null,null,null,null,null,null,null,null,null,null,null,null,null,null,null,null,null,null,null,null,null,null,null,null,null,null,null,null,null,null,null,null,null,null,null,null,null,null,null,null,null,null,null,null,null,null,null,null,null,null,null,null,null,null,null,null,null,null,null,null,null,null,null,null,null,null,null,null,null,null,null,null,null,null,null,null,null,null,null,null,null,null,null,null,null,null,null,null,null,null,null,null,null,null,null,"."]
[null,null,null,null,null,null,null,null,null,null,null,null,null,null,null,null,null,null,null,null,null,null,null,null,null,null,null,null,null,null,null,null,null,null,null,null,null,null,null,null,null,null,null,null,null,null,null,null,null,null,null,null,null,null,null,null,null,null,null,null,null,null,null,null,null,null,null,null,null,null,null,null,null,null,null,null,null,null,null,null,null,null,null,null,null,null,null,null,null,null,null,null,null,null,null,null,null,null,null,null,null,null,null,null,null,null,null,null,null,null,null,null,null,null,null,null,null,null,null,null,null,null,null,null,null,null,null,null,null,null,null,null,null,null,null,null,null,null,null,null,null,null,"."]
[null,null,null,null,null,null,null,null,null,null,null,null,null,null,null,null,null,null,null,null,null,null,null,null,null,null,null,null,null,null,null,null,null,null,null,null,null,null,null,null,null,null,null,null,null,null,null,null,null,null,null,null,null,null,null,null,null,null,null,null,null,null,null,null,null,null,null,null,null,null,null,null,null,null,null,null,null,null,null,null,null,null,null,null,null,null,null,null,null,null,null,null,null,null,null,null,null,null,null,null,null,null,null,null,null,null,null,null,null,null,null,null,null,null,null,null,null,null,null,null,null,null,null,null,null,null,null,null,null,null,null,null,null,null,null,null,null,null,null,null,null,null,"."]
[null,null,null,null,null,null,null,null,null,null,null,null,null,null,null,null,null,null,null,null,null,null,null,null,null,null,null,null,null,null,null,null,null,null,null,null,null,null,null,null,null,null,null,null,null,null,null,null,null,null,null,null,null,null,null,null,null,null,null,null,null,null,null,null,null,null,null,null,null,null,null,null,null,null,null,null,null,null,null,null,null,null,null,null,null,null,null,null,null,null,null,null,null,null,null,null,null,null,null,null,null,null,null,null,null,null,null,null,null,null,null,null,null,null,null,null,null,null,null,null,null,null,null,null,null,null,null,null,null,null,null,null,null,null,null,null,null,null,null,null,null,null,"."]
[null,null,null,null,null,null,null,null,null,null,null,null,null,null,null,null,null,null,null,null,null,null,null,null,null,null,null,null,null,null,null,null,null,null,null,null,null,null,null,null,null,null,null,null,null,null,null,null,null,null,null,null,null,null,null,null,null,null,null,null,null,null,null,null,null,null,null,null,null,null,null,null,null,null,null,null,null,null,null,null,null,null,null,null,null,null,null,null,null,null,null,null,null,null,null,null,null,null,null,null,null,null,null,null,null,null,null,null,null,null,null,null,null,null,null,null,null,null,null,null,null,null,null,null,null,null,null,null,null,null,null,null,null,null,null,null,null,null,null,null,null,null,"."]
[null,null,null,null,null,null,null,null,null,null,null,null,null,null,null,null,null,null,null,null,null,null,null,null,null,null,null,null,null,null,null,null,null,null,null,null,null,null,null,null,null,null,null,null,null,null,null,null,null,null,null,null,null,null,null,null,null,null,null,null,null,null,null,null,null,null,null,null,null,null,null,null,null,null,null,null,null,null,null,null,null,null,null,null,null,null,null,null,null,null,null,null,null,null,null,null,null,null,null,null,null,null,null,null,null,null,null,null,null,null,null,null,null,null,null,null,null,null,null,null,null,null,null,null,null,null,null,null,null,null,null,null,null,null,null,null,null,null,null,null,null,null,"."]
[null,null,null,null,null,null,null,null,null,null,null,null,null,null,null,null,null,null,null,null,null,null,null,null,null,null,null,null,null,null,null,null,null,null,null,null,null,null,null,null,null,null,null,null,null,null,null,null,null,null,null,null,null,null,null,null,null,null,null,null,null,null,null,null,null,null,null,null,null,null,null,null,null,null,null,null,null,null,null,null,null,null,null,null,null,null,null,null,null,null,null,null,null,null,null,null,null,null,null,null,null,null,null,null,null,null,null,null,null,null,null,null,null,null,null,null,null,null,null,null,null,null,null,null,null,null,null,null,null,null,null,null,null,null,null,null,null,null,null,null,null,null,"."]
[null,null,null,null,null,null,null,null,null,null,null,null,null,null,null,null,null,null,null,null,null,null,null,null,null,null,null,null,null,null,null,null,null,null,null,null,null,null,null,null,null,null,null,null,null,null,null,null,null,null,null,null,null,null,null,null,null,null,null,null,null,null,null,null,null,null,null,null,null,null,null,null,null,null,null,null,null,null,null,null,null,null,null,null,null,null,null,null,null,null,null,null,null,null,null,null,null,null,null,null,null,null,null,null,null,null,null,null,null,null,null,null,null,null,null,null,null,null,null,null,null,null,null,null,null,null,null,null,null,null,null,null,null,null,null,null,null,null,null,null,null,null,"."]
[null,null,null,null,null,null,null,null,null,null,null,null,null,null,null,null,null,null,null,null,null,null,null,null,null,null,null,null,null,null,null,null,null,null,null,null,null,null,null,null,null,null,null,null,null,null,null,null,null,null,null,null,null,null,null,null,null,null,null,null,null,null,null,null,null,null,null,null,null,null,null,null,null,null,null,null,null,null,null,null,null,null,null,null,null,null,null,null,null,null,null,null,null,null,null,null,null,null,null,null,null,null,null,null,null,null,null,null,null,null,null,null,null,null,null,null,null,null,null,null,null,null,null,null,null,null,null,null,null,null,null,null,null,null,null,null,null,null,null,null,null,null,"."]
[null,null,null,null,null,null,null,null,null,null,null,null,null,null,null,null,null,null,null,null,null,null,null,null,null,null,null,null,null,null,null,null,null,null,null,null,null,null,null,null,null,null,null,null,null,null,null,null,null,null,null,null,null,null,null,null,null,null,null,null,null,null,null,null,null,null,null,null,null,null,null,null,null,null,null,null,null,null,null,null,null,null,null,null,null,null,null,null,null,null,null,null,null,null,null,null,null,null,null,null,null,null,null,null,null,null,null,null,null,null,null,null,null,null,null,null,null,null,null,null,null,null,null,null,null,null,null,null,null,null,null,null,null,null,null,null,null,null,null,null,null,null,"."]
[null,null,null,null,null,null,null,null,null,null,null,null,null,null,null,null,null,null,null,null,null,null,null,null,null,null,null,null,null,null,null,null,null,null,null,null,null,null,null,null,null,null,null,null,null,null,null,null,null,null,null,null,null,null,null,null,null,null,null,null,null,null,null,null,null,null,null,null,null,null,null,null,null,null,null,null,null,null,null,null,null,null,null,null,null,null,null,null,null,null,null,null,null,null,null,null,null,null,null,null,null,null,null,null,null,null,null,null,null,null,null,null,null,null,null,null,null,null,null,null,null,null,null,null,null,null,null,null,null,null,null,null,null,null,null,null,null,null,null,null,null,null,"."]
[null,null,null,null,null,null,null,null,null,null,null,null,null,null,null,null,null,null,null,null,null,null,null,null,null,null,null,null,null,null,null,null,null,null,null,null,null,null,null,null,null,null,null,null,null,null,null,null,null,null,null,null,null,null,null,null,null,null,null,null,null,null,null,null,null,null,null,null,null,null,null,null,null,null,null,null,null,null,null,null,null,null,null,null,null,null,null,null,null,null,null,null,null,null,null,null,null,null,null,null,null,null,null,null,null,null,null,null,null,null,null,null,null,null,null,null,null,null,null,null,null,null,null,null,null,null,null,null,null,null,null,null,null,null,null,null,null,null,null,null,null,null,"."]
[null,null,null,null,null,null,null,null,null,null,null,null,null,null,null,null,null,null,null,null,null,null,null,null,null,null,null,null,null,null,null,null,null,null,null,null,null,null,null,null,null,null,null,null,null,null,null,null,null,null,null,null,null,null,null,null,null,null,null,null,null,null,null,null,null,null,null,null,null,null,null,null,null,null,null,null,null,null,null,null,null,null,null,null,null,null,null,null,null,null,null,null,null,null,null,null,null,null,null,null,null,null,null,null,null,null,null,null,null,null,null,null,null,null,null,null,null,null,null,null,null,null,null,null,null,null,null,null,null,null,null,null,null,null,null,null,null,null,null,null,null,null,"."]
[null,null,null,null,null,null,null,null,null,null,null,null,null,null,null,null,null,null,null,null,null,null,null,null,null,null,null,null,null,null,null,null,null,null,null,null,null,null,null,null,null,null,null,null,null,null,null,null,null,null,null,null,null,null,null,null,null,null,null,null,null,null,null,null,null,null,null,null,null,null,null,null,null,null,null,null,null,null,null,null,null,null,null,null,null,null,null,null,null,null,null,null,null,null,null,null,null,null,null,null,null,null,null,null,null,null,null,null,null,null,null,null,null,null,null,null,null,null,null,null,null,null,null,null,null,null,null,null,null,null,null,null,null,null,null,null,null,null,null,null,null,null,"."]
[null,null,null,null,null,null,null,null,null,null,null,null,null,null,null,null,null,null,null,null,null,null,null,null,null,null,null,null,null,null,null,null,null,null,null,null,null,null,null,null,null,null,null,null,null,null,null,null,null,null,null,null,null,null,null,null,null,null,null,null,null,null,null,null,null,null,null,null,null,null,null,null,null,null,null,null,null,null,null,null,null,null,null,null,null,null,null,null,null,null,null,null,null,null,null,null,null,null,null,null,null,null,null,null,null,null,null,null,null,null,null,null,null,null,null,null,null,null,null,null,null,null,null,null,null,null,null,null,null,null,null,null,null,null,null,null,null,null,null,null,null,null,"."]
[null,null,null,null,null,null,null,null,null,null,null,null,null,null,null,null,null,null,null,null,null,null,null,null,null,null,null,null,null,null,null,null,null,null,null,null,null,null,null,null,null,null,null,null,null,null,null,null,null,null,null,null,null,null,null,null,null,null,null,null,null,null,null,null,null,null,null,null,null,null,null,null,null,null,null,null,null,null,null,null,null,null,null,null,null,null,null,null,null,null,null,null,null,null,null,null,null,null,null,null,null,null,null,null,null,null,null,null,null,null,null,null,null,null,null,null,null,null,null,null,null,null,null,null,null,null,null,null,null,null,null,null,null,null,null,null,null,null,null,null,null,null,"."]
[null,null,null,null,null,null,null,null,null,null,null,null,null,null,null,null,null,null,null,null,null,null,null,null,null,null,null,null,null,null,null,null,null,null,null,null,null,null,null,null,null,null,null,null,null,null,null,null,null,null,null,null,null,null,null,null,null,null,null,null,null,null,null,null,null,null,null,null,null,null,null,null,null,null,null,null,null,null,null,null,null,null,null,null,null,null,null,null,null,null,null,null,null,null,null,null,null,null,null,null,null,null,null,null,null,null,null,null,null,null,null,null,null,null,null,null,null,null,null,null,null,null,null,null,null,null,null,null,null,null,null,null,null,null,null,null,null,null,null,null,null,null,"."]
[null,null,null,null,null,null,null,null,null,null,null,null,null,null,null,null,null,null,null,null,null,null,null,null,null,null,null,null,null,null,null,null,null,null,null,null,null,null,null,null,null,null,null,null,null,null,null,null,null,null,null,null,null,null,null,null,null,null,null,null,null,null,null,null,null,null,null,null,null,null,null,null,null,null,null,null,null,null,null,null,null,null,null,null,null,null,null,null,null,null,null,null,null,null,null,null,null,null,null,null,null,null,null,null,null,null,null,null,null,null,null,null,null,null,null,null,null,null,null,null,null,null,null,null,null,null,null,null,null,null,null,null,null,null,null,null,null,null,null,null,null,null,"."]
[null,null,null,null,null,null,null,null,null,null,null,null,null,null,null,null,null,null,null,null,null,null,null,null,null,null,null,null,null,null,null,null,null,null,null,null,null,null,null,null,null,null,null,null,null,null,null,null,null,null,null,null,null,null,null,null,null,null,null,null,null,null,null,null,null,null,null,null,null,null,null,null,null,null,null,null,null,null,null,null,null,null,null,null,null,null,null,null,null,null,null,null,null,null,null,null,null,null,null,null,null,null,null,null,null,null,null,null,null,null,null,null,null,null,null,null,null,null,null,null,null,null,null,null,null,null,null,null,null,null,null,null,null,null,null,null,null,null,null,null,null,null,"."]
[null,null,null,null,null,null,null,null,null,null,null,null,null,null,null,null,null,null,null,null,null,null,null,null,null,null,null,null,null,null,null,null,null,null,null,null,null,null,null,null,null,null,null,null,null,null,null,null,null,null,null,null,null,null,null,null,null,null,null,null,null,null,null,null,null,null,null,null,null,null,null,null,null,null,null,null,null,null,null,null,null,null,null,null,null,null,null,null,null,null,null,null,null,null,null,null,null,null,null,null,null,null,null,null,null,null,null,null,null,null,null,null,null,null,null,null,null,null,null,null,null,null,null,null,null,null,null,null,null,null,null,null,null,null,null,null,null,null,null,null,null,null,"."]
[null,null,null,null,null,null,null,null,null,null,null,null,null,null,null,null,null,null,null,null,null,null,null,null,null,null,null,null,null,null,null,null,null,null,null,null,null,null,null,null,null,null,null,null,null,null,null,null,null,null,null,null,null,null,null,null,null,null,null,null,null,null,null,null,null,null,null,null,null,null,null,null,null,null,null,null,null,null,null,null,null,null,null,null,null,null,null,null,null,null,null,null,null,null,null,null,null,null,null,null,null,null,null,null,null,null,null,null,null,null,null,null,null,null,null,null,null,null,null,null,null,null,null,null,null,null,null,null,null,null,null,null,null,null,null,null,null,null,null,null,null,null,"."]
[null,null,null,null,null,null,null,null,null,null,null,null,null,null,null,null,null,null,null,null,null,null,null,null,null,null,null,null,null,null,null,null,null,null,null,null,null,null,null,null,null,null,null,null,null,null,null,null,null,null,null,null,null,null,null,null,null,null,null,null,null,null,null,null,null,null,null,null,null,null,null,null,null,null,null,null,null,null,null,null,null,null,null,null,null,null,null,null,null,null,null,null,null,null,null,null,null,null,null,null,null,null,null,null,null,null,null,null,null,null,null,null,null,null,null,null,null,null,null,null,null,null,null,null,null,null,null,null,null,null,null,null,null,null,null,null,null,null,null,null,null,null,"."]
[null,null,null,null,null,null,null,null,null,null,null,null,null,null,null,null,null,null,null,null,null,null,null,null,null,null,null,null,null,null,null,null,null,null,null,null,null,null,null,null,null,null,null,null,null,null,null,null,null,null,null,null,null,null,null,null,null,null,null,null,null,null,null,null,null,null,null,null,null,null,null,null,null,null,null,null,null,null,null,null,null,null,null,null,null,null,null,null,null,null,null,null,null,null,null,null,null,null,null,null,null,null,null,null,null,null,null,null,null,null,null,null,null,null,null,null,null,null,null,null,null,null,null,null,null,null,null,null,null,null,null,null,null,null,null,null,null,null,null,null,null,null,"."]
[null,null,null,null,null,null,null,null,null,null,null,null,null,null,null,null,null,null,null,null,null,null,null,null,null,null,null,null,null,null,null,null,null,null,null,null,null,null,null,null,null,null,null,null,null,null,null,null,null,null,null,null,null,null,null,null,null,null,null,null,null,null,null,null,null,null,null,null,null,null,null,null,null,null,null,null,null,null,null,null,null,null,null,null,null,null,null,null,null,null,null,null,null,null,null,null,null,null,null,null,null,null,null,null,null,null,null,null,null,null,null,null,null,null,null,null,null,null,null,null,null,null,null,null,null,null,null,null,null,null,null,null,null,null,null,null,null,null,null,null,null,null,"."]
[null,null,null,null,null,null,null,null,null,null,null,null,null,null,null,null,null,null,null,null,null,null,null,null,null,null,null,null,null,null,null,null,null,null,null,null,null,null,null,null,null,null,null,null,null,null,null,null,null,null,null,null,null,null,null,null,null,null,null,null,null,null,null,null,null,null,null,null,null,null,null,null,null,null,null,null,null,null,null,null,null,null,null,null,null,null,null,null,null,null,null,null,null,null,null,null,null,null,null,null,null,null,null,null,null,null,null,null,null,null,null,null,null,null,null,null,null,null,null,null,null,null,null,null,null,null,null,null,null,null,null,null,null,null,null,null,null,null,null,null,null,null,"."]
[null,null,null,null,null,null,null,null,null,null,null,null,null,null,null,null,null,null,null,null,null,null,null,null,null,null,null,null,null,null,null,null,null,null,null,null,null,null,null,null,null,null,null,null,null,null,null,null,null,null,null,null,null,null,null,null,null,null,null,null,null,null,null,null,null,null,null,null,null,null,null,null,null,null,null,null,null,null,null,null,null,null,null,null,null,null,null,null,null,null,null,null,null,null,null,null,null,null,null,null,null,null,null,null,null,null,null,null,null,null,null,null,null,null,null,null,null,null,null,null,null,null,null,null,null,null,null,null,null,null,null,null,null,null,null,null,null,null,null,null,null,null,"."]
[null,null,null,null,null,null,null,null,null,null,null,null,null,null,null,null,null,null,null,null,null,null,null,null,null,null,null,null,null,null,null,null,null,null,null,null,null,null,null,null,null,null,null,null,null,null,null,null,null,null,null,null,null,null,null,null,null,null,null,null,null,null,null,null,null,null,null,null,null,null,null,null,null,null,null,null,null,null,null,null,null,null,null,null,null,null,null,null,null,null,null,null,null,null,null,null,null,null,null,null,null,null,null,null,null,null,null,null,null,null,null,null,null,null,null,null,null,null,null,null,null,null,null,null,null,null,null,null,null,null,null,null,null,null,null,null,null,null,null,null,null,null,"."]
[null,null,null,null,null,null,null,null,null,null,null,null,null,null,null,null,null,null,null,null,null,null,null,null,null,null,null,null,null,null,null,null,null,null,null,null,null,null,null,null,null,null,null,null,null,null,null,null,null,null,null,null,null,null,null,null,null,null,null,null,null,null,null,null,null,null,null,null,null,null,null,null,null,null,null,null,null,null,null,null,null,null,null,null,null,null,null,null,null,null,null,null,null,null,null,null,null,null,null,null,null,null,null,null,null,null,null,null,null,null,null,null,null,null,null,null,null,null,null,null,null,null,null,null,null,null,null,null,null,null,null,null,null,null,null,null,null,null,null,null,null,null,"."]
[null,null,null,null,null,null,null,null,null,null,null,null,null,null,null,null,null,null,null,null,null,null,null,null,null,null,null,null,null,null,null,null,null,null,null,null,null,null,null,null,null,null,null,null,null,null,null,null,null,null,null,null,null,null,null,null,null,null,null,null,null,null,null,null,null,null,null,null,null,null,null,null,null,null,null,null,null,null,null,null,null,null,null,null,null,null,null,null,null,null,null,null,null,null,null,null,null,null,null,null,null,null,null,null,null,null,null,null,null,null,null,null,null,null,null,null,null,null,null,null,null,null,null,null,null,null,null,null,null,null,null,null,null,null,null,null,null,null,null,null,null,null,"."]
[null,null,null,null,null,null,null,null,null,null,null,null,null,null,null,null,null,null,null,null,null,null,null,null,null,null,null,null,null,null,null,null,null,null,null,null,null,null,null,null,null,null,null,null,null,null,null,null,null,null,null,null,null,null,null,null,null,null,null,null,null,null,null,null,null,null,null,null,null,null,null,null,null,null,null,null,null,null,null,null,null,null,null,null,null,null,null,null,null,null,null,null,null,null,null,null,null,null,null,null,null,null,null,null,null,null,null,null,null,null,null,null,null,null,null,null,null,null,null,null,null,null,null,null,null,null,null,null,null,null,null,null,null,null,null,null,null,null,null,null,null,null,"."]
[null,null,null,null,null,null,null,null,null,null,null,null,null,null,null,null,null,null,null,null,null,null,null,null,null,null,null,null,null,null,null,null,null,null,null,null,null,null,null,null,null,null,null,null,null,null,null,null,null,null,null,null,null,null,null,null,null,null,null,null,null,null,null,null,null,null,null,null,null,null,null,null,null,null,null,null,null,null,null,null,null,null,null,null,null,null,null,null,null,null,null,null,null,null,null,null,null,null,null,null,null,null,null,null,null,null,null,null,null,null,null,null,null,null,null,null,null,null,null,null,null,null,null,null,null,null,null,null,null,null,null,null,null,null,null,null,null,null,null,null,null,null,"."]
[null,null,null,null,null,null,null,null,null,null,null,null,null,null,null,null,null,null,null,null,null,null,null,null,null,null,null,null,null,null,null,null,null,null,null,null,null,null,null,null,null,null,null,null,null,null,null,null,null,null,null,null,null,null,null,null,null,null,null,null,null,null,null,null,null,null,null,null,null,null,null,null,null,null,null,null,null,null,null,null,null,null,null,null,null,null,null,null,null,null,null,null,null,null,null,null,null,null,null,null,null,null,null,null,null,null,null,null,null,null,null,null,null,null,null,null,null,null,null,null,null,null,null,null,null,null,null,null,null,null,null,null,null,null,null,null,null,null,null,null,null,null,"."]

{"sheet":"Gallery","index":4,"n_rows":282,"n_cols":42,"rows_kept":282,"cut":false,"hidden":false,"merged":[[96,1,101,8],[95,11,96,18]]}
[]
["Tom Holders and Mounting Brackets"]
[null,null,null,null,null,null,null,null,null,null,null,null,null,null,null,null,null,null,null,null,"MORE >>"]
[]
[]
[]
[]
[]
[]
[]
[]
[null,null,null,null,null,null,null,null,null,null,null,null,null,null,null,null,null,null,null,null,null,null,null,null,null,null,null,null,null,null,null,null,null,null,null,null,null,null,null,null,null,"P1610D"]
[null,null,null,null,null,null,null,null,null,null,null,null,null,null,null,null,null,null,null,null,null,null,null,null,null,null,null,null,null,null,null,null,null,null,null,null,null,null,null,null,null,"Ludwig Classic Bass Casting Only"]
[null,null,null,null,null,null,null,null,null,null,null,null,null,null,null,null,null,null,null,null,null,null,null,null,null,null,null,null,null,null,null,null,null,null,null,null,null,null,null,null,null,"Accepts a 1\" tube"]
[null,null,null,null,null,null,null,null,null,null,null,null,null,null,null,null,null,null,null,null,null,null,null,null,null,null,null,null,null,null,null,null,null,null,null,null,null,null,null,null,null,"Placed 5\" from the front if for a double tom holder"]
[null,null,null,null,null,null,null,null,null,null,null,null,null,null,null,null,null,null,null,null,null,null,null,null,null,null,null,null,null,null,null,null,null,null,null,null,null,null,null,null,null,"Placed 7\" from the front for a single tom holder"]
[]
[]
[]
[null,null,null,null,null,null,null,null,null,null,null,null,null,null,null,null,null,null,null,null,null,null,null,null,null,null,null,null,null,null,null,"LR2980MT"]
[null,null,null,null,null,null,null,null,null,null,null,null,null,null,null,null,null,null,null,null,null,null,null,null,null,null,null,"LR2981MT",null,null,null,"Rocker Double Tom Holder"]
[null,null,null,null,null,null,null,null,null,null,null,null,null,null,null,null,null,null,null,null,null,null,null,null,null,null,null,null,null,null,null,"Placed 5\" from Front head"]
[null,null,null,null,null,null,null,null,null,null,null,null,null,null,null,null,null,null,null,null,null,null,null,null,null,null,null,null,null,null,null,"Holds Classic P1216 Or Keystone Backets"]
[]
[null,null,null,null,null,null,null,null,null,null,null,null,null,null,null,null,null,"LR2991MT",null,null,null,null,"LR2992MT"]
[null,null,null,null,null,null,null,null,null,null,null,null,null,null,null,null,null,"Elite Single Tom Holder",null,null,null,null,"Classic Double Tom Holder",null,null,null,null,null,null,null,null,"Works With:"]
[null,"LAP2984MT Atlas Double Tom Holder",null,null,null,"LAP2985MT Atlas Single",null,null,null,null,null,null,null,null,null,null,null,"10.5mm arm fits Keystone Tom Brackets",null,null,null,null,"Holds Keystone Tom Brackets",null,null,null,null,null,null,null,null,null,"P1610D Classic Tom Brackets",null,null,null,"LR2983MT Rail Consolette Tom Holder (9.5mm)"]
[null,"12mm arms fit Atlas Tom Mounts",null,null,null,"12mm arm fits Atlas Tom Mounts",null,null,null,"LAC2983MT Atlas Arch",null,null,null,null,null,null,null,"Placed 4\" from the front head on 14\" deep drums",null,null,null,null,"Placed 4\" from the front head on 14\" deep drums",null,null,null,null,"Rocker Single Tom Holder",null,null,null,null,"P7202AP Keystone Tom Brackets",null,null,null,"Works with Classic P1216D or Keystone P7202A tom bracket"]
[null,null,null,null,null,null,null,null,null,"Mounts to the bass drum on two Atlas brackets.",null,null,null,null,null,null,null,"Placed 5.5\" from the front edge of 16\" deep drums",null,null,null,null,"Placed 5.5\" from the front edge of 16\" deep drums",null,null,null,null,"Placed 7\" from the front head",null,null,null,null,null,null,null,null,"Be sure to select right or left handed position.",null,null,null,null,"P7184A"]
[null,null,null,null,null,null,null,null,null,"Provides isolation from the bass drum.",null,null,null,null,null,null,null,"Place 7.5\" from the front of 18\" or 20\" deep drums",null,null,null,null,"Place 7.5\" from the front of 18\" or 20\" deep drums",null,null,null,null,"Works With:",null,null,null,null,null,null,null,null,"LR2993MT Rail Consolette Tom Holder (10.5mm)",null,null,null,null,"Elite Bass Casting Only"]
[null,null,null,null,null,null,null,null,null,"12mm arm fits Atlas Tom Mount on tom tom.  ",null,null,null,null,null,null,null,"Works With:",null,null,null,null,"Works With:",null,null,null,null,null,"P1610D Classic Tom Brackets",null,null,null,null,null,null,null,"Works with P7202A Keystone Tom Bracket",null,null,null,null,"Accepts a 1\" tube"]
[null,null,null,null,null,null,null,null,null,null,null,null,null,null,null,null,null,null,"P7185AP Elite Brackets",null,null,null,null,"P7185AP Elite Brackets",null,null,null,null,"P7202AP Keystone Tom Brackets",null,null,null,null,null,null,null,"Be sure to select right or left handed position.",null,null,null,null,"Placed 4\" from the front batter head on 14\" deep drums"]
[null,null,null,null,null,null,null,null,null,null,null,null,null,null,null,null,null,null,"P7202AP Keystone Tom Brackets",null,null,null,null,"P7202AP Keystone Tom Brackets",null,null,null,null,null,null,null,null,null,null,null,null,null,null,null,null,null,"Placed 5.5\" from the front edge of 16\" deep drums"]
["Bass Drum Spurs",null,null,null,null,null,null,null,null,null,null,null,null,null,null,null,null,null,null,null,null,null,null,null,null,null,null,null,null,null,null,null,null,null,null,null,null,null,null,null,null,"Place 7.5\" from the front of 18\" or 20\" deep drums"]
[]
[]
[]
[]
[]
[]
[]
[]
[]
[]
[]
[]
[]
[]
[]
[]
[]
[]
[]
[]
[]
[]
[]
[]
[]
[]
[]
[null,"LR2974SP",null,null,null,"LR2973SP"]
[null,"Both the Elite (LR2974SP) and Rocker (LR2973SP) are kickstand style spurs with extendable legs to fit ",null,null,null,null,null,null,null,null,null,null,null,null,null,null,null,"LAC2973SP"]
[null,"all sizes of bass drums.  Both have rubber tips that can be dialed back to expose sharp points for extra",null,null,null,null,null,null,null,null,null,null,null,null,null,null,null,"Atlas Anchor Spur"]
[null,"hold (on somebody else's wood floor).  ",null,null,null,null,null,null,null,null,"LC1308SP and LC1308SP2",null,null,null,null,null,null,"This is a folding \"Gulwing\" type spur that fastens"]
[null,null,null,null,null,null,null,null,null,null,"The 1308 Curved Spur has a unique look that ",null,null,null,null,null,null,"to the drum with two Atlas mounting brackets."]
[null,null,null,null,null,null,null,null,null,null,"has been popular for decades.  Available on drums",null,null,null,null,null,null,"Adjustable for length, works on drums 18-26\" diameter."]
[null,null,null,null,null,null,null,null,null,null,"22\" diameter and larger.  For extra support, drums ",null,null,null,null,null,null,"Not compatable with Long \"Mach\" lugs."]
["Tom Tom Brackets",null,null,null,null,null,null,null,null,null,"can be ordered with 2 pairs of curved spurs (LC1308SP2).  "]
[]
[]
[]
[]
[]
[]
[]
[]
[]
[]
[]
[]
[]
[]
[]
[]
[]
[]
[]
[null,null,"PM0046 Atlas Mount",null,null,null,null,null,null,"P7202A",null,null,null,null,"L_RK Vibraband w/Keystone Bracket",null,null,null,null,null,null,null,null,null,"P1216D",null,null,null,null,null,"L_RL Vibraband w/Classic Bracket"]
[null,"A combination lug and mounting bracket with vibration isolation built in.",null,null,null,null,null,null,null,"Keystone Tom Bracket",null,null,null,null,null,null,null,null,null,null,null,null,null,null,"Classic Ludwig tom bracket",null,null,null,null,null,"The Classic P1216D bracket is also available on a "]
[null,"Mounts in the place of a Keystone, Mini Classic or Large Classic lugs.",null,null,null,null,null,null,null,"This clamp style bracket works on ",null,null,null,null,"For this application the Keystone bracket will come with a form-fitted mounting plate to go on",null,null,null,null,null,null,null,null,null,"The Classic bracket receives a 9.5mm ",null,null,null,null,null,"Vibraband.  This bracket works only with 9.5mm posts.  "]
[null,"Clamps on to a 12mm rod.  Drums configured with this mount are shipped ",null,null,null,null,null,null,null,"either 9.5mm or 10.5mm posts.  ",null,null,null,null,"the vibraband to minimize the provile of the mounting hardware and maximize the appearance",null,null,null,null,null,null,null,null,null,"post and secures it with an internal "]
[null,"with a 12mm L-arm to retro-fit into any Ludwig Tom holder.",null,null,null,null,null,null,null,null,null,null,null,null,"of your drum.",null,null,null,null,null,null,null,null,null,"eye bolt.  "]
[null,"Not compatable with Long \"Mach\" lugs."]
[]
[null,"Notes on Tom Brackets:",null,null,null,null,null,null,null,null,null,"Vibrabands are included with toms but not installed to allow the player to position the drum correctly."]
[null,"If you order a tom with the tom bracket drilled into the shell (not Atlas) that tom will have two badges, one on each side of the tom bracket.  That way, however you mount the drum, one of the badges will be facing out.  Toms with Vibrabands, Atlas Mounts, or no mounts will have one badge.  The player will always be able to position the badge correctly. "]
[]
[]
[]
[]
[]
[]
[]
[]
[]
[]
["Floor Tom Legs"]
[]
[]
[]
[]
[]
[]
[]
[]
[]
[]
[]
[]
[]
[]
[]
[]
[]
[]
[]
[]
[]
[]
[]
[]
[null,null,null,null,null,null,null,null,null,null,null,null,null,null,null,null,"Atlas Legs and Mounts"]
[null,"Classic Legs and Brackets.  ",null,null,null,null,null,null,"Keystone Legs and Brackets",null,null,null,null,null,null,null,"Atlas Mounts take the places of 3 Mini Classic or "]
[null,"Three P1216D brackets with 23\" long 9.5mm legs. ",null,null,null,null,null,null,"Three P7202A Keystone brackets with 17\" long 10.5mm legs.",null,null,null,null,null,null,null,"Large Classic Lugs and clamp on to 12mm legs.  "]
[null,null,null,null,null,null,null,null,null,null,null,null,null,null,null,null,"Not compatable with Long \"Mach\" lugs."]
[]
[]
[]
[]
[]
[]
[]
[]
["Snare Strainers"]
[]
[]
[]
[]
[]
[]
[]
[]
[]
[]
[]
[]
[]
[]
[]
[]
[]
[]
[]
[]
[]
[]
[]
[]
[null,"P85 Supraphonic",null,null,null,"P86 Millennium",null,null,null,null,null,null,"P70 SuperSensitive",null,"use on 5\" deep drums"]
[null,"Side Lever action",null,null,null,"Top Lever action",null,null,null,null,null,null,"P71 Super Sensitive",null,"Use on 6.5\" deep drums"]
[null,"Adjustable tension",null,null,null,"Adjustable Tension",null,null,null,null,null,null,"Double end throwoff"]
[null,"Use on 5\" and deeper drums",null,null,null,"Use on 5\" and Deeper drums",null,null,null,null,null,null,"Snare contact over entire head"]
[null,null,null,null,null,null,null,null,null,null,null,null,"Adjustable Tension and pressure"]
[]
["Snare Butts"]
[]
[]
[]
[]
[]
[]
[]
[]
[]
[]
[]
[]
[]
[]
[]
[null,null,"P33 Die Cast Butt",null,null,null,null,null,null,"P32 Stamped butt"]
[null,null,"The P33 die cast butt is standard on most Ludwig snares.  ",null,null,null,null,null,null,"The P32 is the old school stamped steel snare butt works with tape or string to"]
[null,null,"Works with tape or string to hold traditional snares.  Clamp",null,null,null,null,null,null,"hold traditional snares.  Clamp is tightened with a phillips or flat screwdriver."]
[null,null,"action is tightened with a drum key."]
[]
[]
[]
["Snare Drum Lugs"]
[]
[]
[]
[]
[]
[]
[]
[]
[null,null,"Small Twin Lugs",null,null,null,null,null,"Large Twin Lugs"]
[null,null,"P2240 lugs are standard on 5\", and",null,null,null,null,null,"P2239 is the large version of the "]
[null,null,"6\" deep snare drums and an option",null,null,null,null,null,"Classic Bow Tie lug.  Standard on "]
[null,null,"on 6.5\" deep snares.  ",null,null,null,null,null,"6.5\" and 8\" deep snares. ",null,null,null,null,null,"Tube Lugs",null,null,null,null,null,null,null,null,"Mini Classic Lugs"]
[null,null,"P2217 lugs are standard on ",null,null,null,null,null,null,null,null,null,null,null,"P2253 tube lugs are an option on 5\", 6\" and 6.5\" ",null,null,null,null,null,null,null,null,"P22246D Mini Classic Lugs are available on 6\" and deeper snare drums."]
[null,null,"3.5\" deep piccolo snares.",null,null,null,null,null,null,null,null,null,null,null,"deep snare drums.  ",null,null,null,null,null,null,null,null,"This is the same Mini Classic Lug that is standard "]
[null,null,null,null,null,null,null,null,null,null,null,null,null,null,"P22531 tube lugs are an option on 3.5\" deep piccolo snares. ",null,null,null,null,null,null,null,null,"on Classic Maple and Legacy Toms and Bass Drums."]
[]
[]
[]
[null,null,null,null,null,null,null,null,null,null,null,null,null,null,null,null,null,"5x14 with Tube Lugs"]
[]
[]
[]
[]
[]
[]
[]
[]
[]
[null,null,null,null,null,null,null,null,null,"6.5x14 wth Large Twin Lugs"]
[null,null,"5X14 Snare with Small Twin Lugs"]
[]
[]
[]
[]
[]
[null,null,null,null,null,null,null,null,null,null,null,null,null,null,null,null,null,null,null,null,null,null,null,"6x12 with Mini Classic Lugs"]
[]
[]
[]
[]
[]
[]
[]
[]
[null,null,null,null,null,null,null,null,null,"8x14 with Large Twin Lugs"]
[]
[]
[]
["T-Handle Tension Rods for Bass Drum",null,null,null,null,null,null,null,"Tone Control (Internal)"]
[]
[]
[]
[]
[]
[]
[]
[]
[]
[]
[]
[]
[]
[]
[]
[]
[]
[]
[]
[]
[null,null,null,null,null,null,null,null,null,"Tone Controls can be added to toms, floor toms and snares."]
[null,null,null,null,null,null,null,null,null,"(Batter head only)"]
[]
[]
[]
[]
[]
[]
[null,"Bass Drums with T-handles still get "]
[null,"keyrods on the 2 bottom lugs front and back to avoid "]
[null,"hitting the floor or the bass pedal."]
[null,"A nylon spacer installed under the shoulder provides "]
[null,"clearance for the T-handle to clear the clawhook."]
[null,"Not compatable with Keystone claw hooks."]